{"text_format":"3","workbook":"xlsx","n_sheets":7,"sheets":["表の見方","簡易懸濁データ表","20150723マスター条件","21050723","20150612メーカーまで入力済み保存版","20150615コメント未","29150616コメント入力"],"not_rendered":{"images":1,"defined_names":10},"read":"whole","date_system":"1900"}

{"sheet":"表の見方","index":0,"n_rows":55,"n_cols":5,"rows_kept":55,"merged":[[50,2,50,3],[52,2,52,3],[53,2,53,3]]}
[]
["★簡易懸濁フラグの決定方法★"]
["簡易懸濁の可否について「①特殊→②ハンドブック→③メーカー→④他院DB→⑤実験」の順に調査し、データがあった時点で可否を決定しました。（フラグ1,2,6に振り分け）"]
["その後、一包化の可否を考慮し、フラグ1,2,3,4,6に振り分けました。"]
[]
[]
["★簡易懸濁データ表の見方★"]
["薬品名：","当院院内採用薬（内服）となっています。フィルター（右の▼）を開いて薬剤名検索が可能です。"]
["一包化：","錠剤分包機で一包化されるかどうかの設定です。●カセット　▲DTA　×一包化しない"]
["簡易懸濁フラグ：","ユヤマのマスタに設定したフラグです。フラグにはそれぞれフラグコメントが設定されており、処方箋・控え・薬袋に印字されます。"]
[null,"印字は最大全角30文字まで可能です。"]
[]
[null,"番号","フラグ名","フラグコメント（処方箋・控え・薬袋に印字）","解説"]
[null,0,"無し",null,"使用しない"]
[null,1,"懸濁可","簡易懸濁可","通常の方法で簡易懸濁可能な薬剤"]
[null,2,"破壊","★コーティングに亀裂を入れる★　簡易懸濁可","亀裂を入れると簡易懸濁可能な薬剤"]
[null,3,"ヒート破壊","★コーティングに亀裂を入れる★　簡易懸濁可","一包化不可の薬剤で、亀裂を入れると簡易懸濁可能な薬剤"]
[null,4,"ヒート","簡易懸濁可","一包化不可の薬剤で、通常の方法で簡易懸濁可能な薬剤"]
[null,5,"懸濁不可",null,"使用しない（ユヤマシステム突破不可のため）"]
[null,6,"懸濁不適","■■簡易懸濁不適■■","簡易懸濁不可の薬剤（ユヤマシステム突破可能）"]
[]
["特殊：","簡易懸濁の対象外と考える薬剤などです。"]
["ハンドブック：","「内服薬経管投与ハンドブック 第3版」に掲載されているデータです。"]
["メーカー：","メーカーに問い合わせた際の回答です。"]
["他院DB：","複数の他施設のデータベース（参考として見せていただいたものやインターネット掲載のもの）を基に判断しました。"]
[null,"（国立病院機構　東京医療センター・焼津市民病院・川崎）"]
["実験：","当院で実験した結果です。10分放置後の懸濁性と8Fr.チューブの通過性を見て判断しました。参考程度として下さい。"]
["情報：","メーカーに問い合わせをした際の詳細なデータ内容や、剤型変更の推奨など、薬剤の情報を記載しています。"]
["薬剤コメント：","フラグコメント以外に各薬剤に対するコメントが必要な場合、ここに入力します。処方箋・控え・薬袋に印字されます。"]
[null,"印字はフラグコメントとは別に最大全角30文字まで可能です。"]
[]
[null,"K001      ","◆投与直前にコーティングに亀裂を入れる◆ ",null,"例"]
[null,"K002      ","2.5gあたり水20mLで懸濁しすぐに注入                                       "]
[null,"K003      ","頭部挙上状態で投与",null,"ＢＰ製剤"]
[null,"K004      ","多めの水でフラッシュ                                                  "]
[null,"K005      ","しっかり破壊（20回以上たたく）                                            "]
[null,"K006      ","常温の水で懸濁                                                     ",null,"ネキシウム・ランソプラゾール"]
[null,"K007      ","単独投与　常温の水で懸濁し10分待たずにすぐに注入 "]
[null,"K008      ","単独投与　他剤や食事と1時間以上間隔をあけるほうが良い"]
[null,"K009      ","単独投与　投与器具は毎回破棄　曝露に注意 ",null,"抗がん剤"]
[null,"K010      ","単独投与　溶解は55℃温水でも常温の水でも可 "]
[null,"K011      ","通常より時間をかけて懸濁                                                "]
[null,"K012      ","溶けないため振り混ぜながら注入 "]
[null,"K013      ","ゆっくり注入                                                      "]
[null,"K014      ","酸化ﾏｸﾞﾈｼｳﾑ(ﾏｸﾞﾗｯｸｽ等)と同時懸濁しない/多めの水でﾌﾗｯｼｭ "]
[null,"K015      ","酸化ﾏｸﾞﾈｼｳﾑ(ﾏｸﾞﾗｯｸｽ等)と同時懸濁しない "]
[null,"K016      ","単独投与　常温の水で懸濁  "]
[null,"K017      ","単独投与　他剤服用後30分～1時間は間隔をあけるほうが良い "]
[null,"K018      ","投与方法は要相談                                                    ",null,"ＨＩＶ"]
[null,"K019　","冷所保存　単独投与　投与器具は毎回破棄　曝露に注意 "]
[null,"K020","単独投与"]
[null,"K021","1包あたり水20mLで懸濁"]
[null,"K022","しっかり混和する"]
[null,"K023","25分待ってから注入"]
[null,"K024","脱カプセル　多めの水でフラッシュ",null,"※血糖降下薬は簡易懸濁時のみでなく全ての薬袋にコメントが入るので、表更新時は、右の欄に記載する"]

{"sheet":"簡易懸濁データ表","index":1,"n_rows":988,"n_cols":15,"rows_kept":988}
[]
["薬品名","販売","製造","一包化","簡易懸濁フラグ","簡易懸濁結果","特殊等","ハンドブック","メーカー","他院DB","実験","情報","薬剤コメント(30文字以内)","薬品名","採用有無"]
["ｄ-クロルフェニラミンマレイン酸塩徐放錠6mg「武田テバ」","テバ",null,"●",6,{"$f":"IF(G3&H3&I3&I3&J3&K3=\"\",\"\",IF(G3&H3&I3&J3=\"\",K3,IF(G3&H3&I3=\"\",J3,(IF(G3&H3=\"\",I3,IF(G3=\"\",H3,G3))))))","v":6},null,6,{"$nulls":3},"徐放性　ポララミン（同成分）注へ変更、第二世代抗ヒスタミン薬へ変更",null,"ネオマレルミンＴＲ錠6ｍｇ"]
["Ｄ－ソルビトール","丸石",null,null,6,6,{"$nulls":3},6,null,"14Fr.は通過　13Fr.以下の細いチューブの場合は主治医と相談",null,"Ｄ－ソルビトール","院内採用"]
["Ｌ－ケフレックス顆粒　５００ｍｇ",{"$nulls":3},6,6,null,6,{"$nulls":3},"胃溶性顆粒と腸溶性顆粒の配合剤のため不適　他の抗生剤に変更",null,"Ｌ－ケフレックス顆粒　５００ｍｇ","院内採用"]
["ＰＬ配合顆粒",{"$nulls":3},1,1,null,1,{"$nulls":5},"ＰＬ配合顆粒","院内採用"]
["Ｓ・Ｍ散",{"$nulls":3},1,1,null,1,{"$nulls":5},"Ｓ・Ｍ散","院内採用"]
["アーチスト錠１０ｍｇ",null,null,"●",1,1,null,1,{"$nulls":5},"アーチスト錠１０ｍｇ"]
["アーチスト錠２．５ｍｇ","第一三共",null,"●",1,1,null,null,1,{"$nulls":4},"アーチスト錠２．５ｍｇ"]
["アーテン錠（２ｍｇ）　",null,null,"▲",1,1,null,1,{"$nulls":5},"アーテン錠（２ｍｇ）　"]
["アーリーダ錠60mg",{"$nulls":3},6,{"$nulls":3},6,null,null,"抗がん剤 主治医と相談","単独投与　投与器具は毎回破棄　曝露に注意"]
["アイクルシグ錠15mg",{"$nulls":3},1,{"$nulls":3},1,null,null,"抗がん剤","単独投与　投与器具は毎回破棄　曝露に注意",null,"院内採用"]
["アイセントレス錠４００ｍｇ","MSD",null,"×",3,{"$f":"IF(G13&H13&I13&I13&J13&K13=\"\",\"\",IF(G13&H13&I13&J13=\"\",K13,IF(G13&H13&I13=\"\",J13,(IF(G13&H13=\"\",I13,IF(G13=\"\",H13,G13))))))","v":2},2,6,{"$nulls":3},"HIV/破壊し長時間かければ投与可","通常より時間をかけて懸濁","アイセントレス錠４００ｍｇ","院内採用"]
["アイセントレス錠9００ｍｇ",null,null,"×",3,null,2,6,{"$nulls":3},"HIV/破壊し長時間かければ投与可","通常より時間をかけて懸濁",null,"院内採用"]
["アイトロール錠２０ｍｇ",null,null,"▲",1,{"$f":"IF(G15&H15&I15&I15&J15&K15=\"\",\"\",IF(G15&H15&I15&J15=\"\",K15,IF(G15&H15&I15=\"\",J15,(IF(G15&H15=\"\",I15,IF(G15=\"\",H15,G15))))))","v":1},null,1,{"$nulls":5},"アイトロール錠２０ｍｇ","院内採用"]
["アイトロール錠２０ｍｇ",{"$nulls":3},1,null,null,1,1,{"$nulls":5},"院内採用"]
["アカルディカプセル１．２５ｍｇ",null,null,"×",4,{"$f":"IF(G17&H17&I17&I17&J17&K17=\"\",\"\",IF(G17&H17&I17&J17=\"\",K17,IF(G17&H17&I17=\"\",J17,(IF(G17&H17=\"\",I17,IF(G17=\"\",H17,G17))))))","v":1},null,1,{"$nulls":5},"アカルディカプセル１．２５ｍｇ"]
["アカルボースOD錠50mg「ファイザー」",{"$nulls":3},1,{"$nulls":3},1,{"$nulls":3},"血糖降下薬"]
["アカルボース錠50mg「サワイ」",{"$nulls":3},1,{"$nulls":3},1,null,null,"崩壊しなければさらに5分おく","血糖降下薬",null,"院内採用"]
["アキネトン錠　１ｍｇ",null,null,"▲",1,{"$f":"IF(G20&H20&I20&I20&J20&K20=\"\",\"\",IF(G20&H20&I20&J20=\"\",K20,IF(G20&H20&I20=\"\",J20,(IF(G20&H20=\"\",I20,IF(G20=\"\",H20,G20))))))","v":1},null,1,{"$nulls":5},"アキネトン錠　１ｍｇ"]
["アクトス錠１５",null,null,"▲",1,{"$f":"IF(G21&H21&I21&I21&J21&K21=\"\",\"\",IF(G21&H21&I21&J21=\"\",K21,IF(G21&H21&I21=\"\",J21,(IF(G21&H21=\"\",I21,IF(G21=\"\",H21,G21))))))","v":1},null,1,{"$nulls":4},"血糖降下薬","アクトス錠１５"]
["アクトネル錠２．５ｍｇ","エーザイ","味のもと","▲",1,{"$f":"IF(G22&H22&I22&I22&J22&K22=\"\",\"\",IF(G22&H22&I22&J22=\"\",K22,IF(G22&H22&I22=\"\",J22,(IF(G22&H22=\"\",I22,IF(G22=\"\",H22,G22))))))","v":1},null,null,1,null,null,"17.5mｇのデータ参照",null,"アクトネル錠２．５ｍｇ"]
["アグリリンカプセル0.5mg",{"$nulls":3},6,{"$nulls":3},6,null,null,"データなし　抗がん剤 代用薬ないため主治医判断　","単独投与　投与器具は毎回破棄　曝露に注意"]
["アコファイド錠100ｍｇ","ゼリア",null,"▲",1,{"$f":"IF(G24&H24&I24&I24&J24&K24=\"\",\"\",IF(G24&H24&I24&J24=\"\",K24,IF(G24&H24&I24=\"\",J24,(IF(G24&H24=\"\",I24,IF(G24=\"\",H24,G24))))))","v":1},null,null,1,{"$nulls":4},"アコファイド錠100ｍｇ","院内採用"]
["アサコール錠４００ｍｇ","協和発酵キリン","ゼリア","×",6,{"$f":"IF(G25&H25&I25&I25&J25&K25=\"\",\"\",IF(G25&H25&I25&J25=\"\",K25,IF(G25&H25&I25=\"\",J25,(IF(G25&H25=\"\",I25,IF(G25=\"\",H25,G25))))))","v":6},null,null,6,null,null,"腸溶性（メサラジンを大腸まで到達させるため)　腸から投与であれば破壊後懸濁可　胃からの投与であれば主治医相談",null,"アサコール錠４００ｍｇ"]
["アザルフィジンＥＮ錠　５００ｍｇ",null,null,"▲",6,{"$f":"IF(G26&H26&I26&I26&J26&K26=\"\",\"\",IF(G26&H26&I26&J26=\"\",K26,IF(G26&H26&I26=\"\",J26,(IF(G26&H26=\"\",I26,IF(G26=\"\",H26,G26))))))","v":6},null,6,{"$nulls":3},"腸溶錠(消化管障害防止)　腸から投与であれば破壊後懸濁可　胃からの投与であれば主治医相談",null,"アザルフィジンＥＮ錠　５００ｍｇ","院内採用"]
["ｱｼﾞｽﾛﾏｲｼﾝ錠500mg「ﾄｰﾜ」",{"$nulls":3},1,{"$nulls":3},1,{"$nulls":5},"院内採用"]
["アジスロマイシン小児用錠100mg「タカタ」",{"$nulls":3},1,{"$nulls":3},1,{"$nulls":5},"院内採用"]
["アシノン錠１５０ｍｇ",null,null,"▲",1,{"$f":"IF(G29&H29&I29&I29&J29&K29=\"\",\"\",IF(G29&H29&I29&J29=\"\",K29,IF(G29&H29&I29=\"\",J29,(IF(G29&H29=\"\",I29,IF(G29=\"\",H29,G29))))))","v":1},null,1,{"$nulls":5},"アシノン錠１５０ｍｇ"]
["アジャストＡコーワ錠４０ｍｇ","興和創薬",null,"●",6,{"$f":"IF(G30&H30&I30&I30&J30&K30=\"\",\"\",IF(G30&H30&I30&J30=\"\",K30,IF(G30&H30&I30=\"\",J30,(IF(G30&H30=\"\",I30,IF(G30=\"\",H30,G30))))))","v":6},null,6,{"$nulls":3},"　ピコスルファートナトリウム内用液（同効）へ変更　",null,"アジャストＡコーワ錠４０ｍｇ","院内採用"]
["アジルバ錠４０ｍｇ","武田",null,"●",1,{"$f":"IF(G31&H31&I31&I31&J31&K31=\"\",\"\",IF(G31&H31&I31&J31=\"\",K31,IF(G31&H31&I31=\"\",J31,(IF(G31&H31=\"\",I31,IF(G31=\"\",H31,G31))))))","v":1},null,null,1,{"$nulls":4},"アジルバ錠４０ｍｇ","院内採用"]
["アジレクト錠1mg",{"$nulls":3},1,{"$nulls":3},1]
["アスパラカリウム散　５０％","田辺製薬販売",null,null,6,{"$f":"IF(G33&H33&I33&I33&J33&K33=\"\",\"\",IF(G33&H33&I33&J33=\"\",K33,IF(G33&H33&I33=\"\",J33,(IF(G33&H33=\"\",I33,IF(G33=\"\",H33,G33))))))","v":6},6,{"$nulls":4},"データなし　K.C.L.エリキシル（同効）・グルコン酸K細粒（同効）へ変更　",null,"アスパラカリウム散　５０％","院内採用"]
["アスパラカリウム錠　３００ｍｇ",null,null,"×",6,6,null,6,{"$nulls":3},"吸湿固化あるため不可　K.C.L.エリキシル（同効）・グルコン酸K細粒（同効）へ変更　",null,"アスパラカリウム錠　３００ｍｇ","院内採用"]
["アスピリン原末「ﾏﾙｲｼ」","日本新薬",null,null,1,1,{"$nulls":3},1,null,"溶解しないが懸濁状態で通過",null,"アスピリン","院内採用"]
["アスペノンカプセル１０ｍｇ",null,null,"▲",1,1,null,1,{"$nulls":3},"アスペノンカプセル20mｇ参照",null,"アスペノンカプセル１０ｍｇ","院内採用"]
["アセチルスピラマイシン錠　２００ｍｇ",null,null,"▲",1,1,null,1,{"$nulls":5},"アセチルスピラマイシン錠　２００ｍｇ"]
["アセトアミノフェン原末「ハチ」",{"$nulls":3},1,1,1,6,null,null,1,"ハンドブックは12Fr.　溶解しないが実験では8Fr.通過（フラッシュは多めで）",null,"アセトアミノフェン「マルイシ」","院内採用"]
["アセトアミノフェン錠200mg「マルイシ」",{"$nulls":3},1,{"$nulls":3},1,{"$nulls":5},"院内採用"]
["アセトアミノフェン錠500mg「マルイシ」",{"$nulls":3},1,{"$nulls":3},1,{"$nulls":5},"院内採用"]
["アゼルニジピン錠16mg「トーワ」",{"$nulls":3},2,{"$nulls":3},2,{"$nulls":5},"院内採用"]
["アゾセミド錠60mg「JG」",{"$nulls":3},1,{"$nulls":3},1,{"$nulls":5},"院内採用"]
["アタラックス－Ｐカプセル２５ｍｇ　",null,null,"▲",1,{"$f":"IF(G43&H43&I43&I43&J43&K43=\"\",\"\",IF(G43&H43&I43&J43=\"\",K43,IF(G43&H43&I43=\"\",J43,(IF(G43&H43=\"\",I43,IF(G43=\"\",H43,G43))))))","v":1},null,1,{"$nulls":3},"多めの水でフラッシュ",null,"アタラックス－Ｐカプセル２５ｍｇ　","院内採用"]
["アタラックス-Pドライシロップ2.5%","ファイザー",null,null,1,{"$f":"IF(G44&H44&I44&I44&J44&K44=\"\",\"\",IF(G44&H44&I44&J44=\"\",K44,IF(G44&H44&I44=\"\",J44,(IF(G44&H44=\"\",I44,IF(G44=\"\",H44,G44))))))","v":1},1,{"$nulls":4},"アタラックスPカプセルは懸濁可/簡易懸濁データなし","単独投与　常温の水で懸濁","アタラックス-Pドライシロップ2.5%","院内採用"]
["アテノロール錠50mg「トーワ」",{"$nulls":3},1,null,null,1,1,{"$nulls":5},"院内採用"]
["アデホスコーワ顆粒１０％",{"$nulls":3},6,{"$f":"IF(G46&H46&I46&I46&J46&K46=\"\",\"\",IF(G46&H46&I46&J46=\"\",K46,IF(G46&H46&I46=\"\",J46,(IF(G46&H46=\"\",I46,IF(G46=\"\",H46,G46))))))","v":6},null,6,{"$nulls":3},"湿・湿気で失活のため不可　ATP注（同成分）へ変更　",null,"アデホスコーワ顆粒１０％","院内採用"]
["アテレック錠　１０ｍｇ",null,null,"●",1,{"$f":"IF(G47&H47&I47&I47&J47&K47=\"\",\"\",IF(G47&H47&I47&J47=\"\",K47,IF(G47&H47&I47=\"\",J47,(IF(G47&H47=\"\",I47,IF(G47=\"\",H47,G47))))))","v":1},null,1,{"$nulls":5},"アテレック錠　１０ｍｇ"]
["アトーゼット配合錠LD",{"$nulls":3},6,{"$nulls":3},6,null,null,"データなし　ゼチーア10ｍｇ（同成分）＋アトルバスタチンＯＤ10ｍｇ（同成分）へ変更"]
["アドシルカ錠20ｍｇ","リリー","日本新薬","▲",1,{"$f":"IF(G49&H49&I49&I49&J49&K49=\"\",\"\",IF(G49&H49&I49&J49=\"\",K49,IF(G49&H49&I49=\"\",J49,(IF(G49&H49=\"\",I49,IF(G49=\"\",H49,G49))))))","v":1},{"$nulls":3},1,{"$nulls":3},"アドシルカ錠20ｍｇ","院内採用"]
["アドソルビン原末",{"$nulls":3},1,{"$f":"IF(G50&H50&I50&I50&J50&K50=\"\",\"\",IF(G50&H50&I50&J50=\"\",K50,IF(G50&H50&I50=\"\",J50,(IF(G50&H50=\"\",I50,IF(G50=\"\",H50,G50))))))","v":1},null,1,{"$nulls":4},"単独投与　他剤や食事と1時間以上間隔をあけるほうが良い","アドソルビン","院内採用"]
["アドナ錠３０ｍｇ　",null,null,"●",1,{"$f":"IF(G51&H51&I51&I51&J51&K51=\"\",\"\",IF(G51&H51&I51&J51=\"\",K51,IF(G51&H51&I51=\"\",J51,(IF(G51&H51=\"\",I51,IF(G51=\"\",H51,G51))))))","v":1},null,1,{"$nulls":5},"アドナ錠３０ｍｇ　"]
["アトルバスタチンOD錠10ｍｇ「トーワ」","東和",null,"●",1,{"$f":"IF(G52&H52&I52&I52&J52&K52=\"\",\"\",IF(G52&H52&I52&J52=\"\",K52,IF(G52&H52&I52=\"\",J52,(IF(G52&H52=\"\",I52,IF(G52=\"\",H52,G52))))))","v":1},null,null,1,{"$nulls":4},"アトルバスタチンOD錠10ｍｇ「トーワ」","院内採用"]
["アナストロゾール錠　１mg「EE」",{"$nulls":3},4,{"$nulls":5},4,"抗がん剤","単独投与　投与器具は毎回破棄　曝露に注意",null,"院内採用"]
["アナフラニール錠１０ｍｇ",null,null,"▲",2,{"$f":"IF(G54&H54&I54&I54&J54&K54=\"\",\"\",IF(G54&H54&I54&J54=\"\",K54,IF(G54&H54&I54=\"\",J54,(IF(G54&H54=\"\",I54,IF(G54=\"\",H54,G54))))))","v":2},null,2,{"$nulls":5},"アナフラニール錠１０ｍｇ","院内採用"]
["アフィニトール錠　５ｍｇ","ノバルティス",null,"×",4,{"$f":"IF(G55&H55&I55&I55&J55&K55=\"\",\"\",IF(G55&H55&I55&J55=\"\",K55,IF(G55&H55&I55=\"\",J55,(IF(G55&H55=\"\",I55,IF(G55=\"\",H55,G55))))))","v":1},null,1,{"$nulls":3},"抗がん剤","単独投与　投与器具は毎回破棄　曝露に注意","アフィニトール錠　５ｍｇ"]
["アプレゾリン錠１０ｍｇ　",null,null,"▲",2,{"$f":"IF(G56&H56&I56&I56&J56&K56=\"\",\"\",IF(G56&H56&I56&J56=\"\",K56,IF(G56&H56&I56=\"\",J56,(IF(G56&H56=\"\",I56,IF(G56=\"\",H56,G56))))))","v":2},null,2,{"$nulls":3},"★破壊★　多めの水でフラッシュ",null,"アプレゾリン錠１０ｍｇ　","院内採用"]
["アプレピタントカプセル125mg「サワイ」",{"$nulls":3},4,{"$nulls":3},4,null,null,"脱カプセルし多めの水で通常の簡易懸濁の条件で懸濁すれば、8Frのチューブ通過可能とメーカーの情報あり","脱カプセル　多めの水でフラッシュ",null,"院内採用"]
["アプレピタントカプセル80mg「サワイ」",{"$nulls":3},4,{"$nulls":3},4,null,null,"脱カプセルし多めの水で通常の簡易懸濁の条件で懸濁すれば、8Frのチューブ通過可能とメーカーの情報あり","脱カプセル　多めの水でフラッシュ",null,"院内採用"]
["アベロックス錠４００ｍｇ","富士フィルム","バイエル","▲",1,{"$f":"IF(G59&H59&I59&I59&J59&K59=\"\",\"\",IF(G59&H59&I59&J59=\"\",K59,IF(G59&H59&I59=\"\",J59,(IF(G59&H59=\"\",I59,IF(G59=\"\",H59,G59))))))","v":1},null,1,{"$nulls":5},"アベロックス錠４００ｍｇ","院内採用"]
["アボルブカプセル　０．５ｍｇ","グラクソ",null,"×",6,{"$f":"IF(G60&H60&I60&I60&J60&K60=\"\",\"\",IF(G60&H60&I60&J60=\"\",K60,IF(G60&H60&I60=\"\",J60,(IF(G60&H60=\"\",I60,IF(G60=\"\",H60,G60))))))","v":6},null,null,6,null,null,"カプセル内脂溶性液体のため簡易懸濁不可・口腔内刺激あり　代用薬ないため主治医判断　",null,"アボルブカプセル　０．５ｍｇ"]
["アマリ－ル１ｍｇ錠",null,null,"▲",1,{"$f":"IF(G61&H61&I61&I61&J61&K61=\"\",\"\",IF(G61&H61&I61&J61=\"\",K61,IF(G61&H61&I61=\"\",J61,(IF(G61&H61=\"\",I61,IF(G61=\"\",H61,G61))))))","v":1},null,1,{"$nulls":4},"血糖降下薬","アマリ－ル１ｍｇ錠","院内採用"]
["アミオダロン速崩錠100mg「TE」",{"$nulls":3},1,{"$nulls":3},1,{"$nulls":5},"院内採用"]
["アミサリン錠１２５ｍｇ",null,null,"▲",6,{"$f":"IF(G63&H63&I63&I63&J63&K63=\"\",\"\",IF(G63&H63&I63&J63=\"\",K63,IF(G63&H63&I63=\"\",J63,(IF(G63&H63=\"\",I63,IF(G63=\"\",H63,G63))))))","v":6},null,6,{"$nulls":3},"データなし　錠剤粉砕可　",null,"アミサリン錠１２５ｍｇ","院内採用"]
["アミティーザカプセル12μg",{"$nulls":3},1,{"$nulls":3},1,{"$nulls":5},"院内採用"]
["アミティーザカプセル24μｇ","スキャンポファーマ",null,"●",1,{"$f":"IF(G65&H65&I65&I65&J65&K65=\"\",\"\",IF(G65&H65&I65&J65=\"\",K65,IF(G65&H65&I65=\"\",J65,(IF(G65&H65=\"\",I65,IF(G65=\"\",H65,G65))))))","v":1},null,null,1,{"$nulls":4},"アミティーザカプセル24μｇ"]
["アムノレイク錠２ｍｇ","日本新薬","東光","×",6,{"$f":"IF(G66&H66&I66&I66&J66&K66=\"\",\"\",IF(G66&H66&I66&J66=\"\",K66,IF(G66&H66&I66=\"\",J66,(IF(G66&H66=\"\",I66,IF(G66=\"\",H66,G66))))))","v":6},{"$nulls":3},6,null,"データなし　抗がん剤　代用薬ないため主治医判断　","単独投与　投与器具は毎回破棄　曝露に注意","アムノレイク錠２ｍｇ","院内採用"]
["アムロジピンＯＤ錠5ｍｇ「ＥＭＥＣ」",null,null,"●",1,{"$f":"IF(G67&H67&I67&I67&J67&K67=\"\",\"\",IF(G67&H67&I67&J67=\"\",K67,IF(G67&H67&I67=\"\",J67,(IF(G67&H67=\"\",I67,IF(G67=\"\",H67,G67))))))","v":1},null,1,{"$nulls":5},"アムロジピンＯＤ錠5ｍｇ「ＥＭＥＣ」","院内採用"]
["ｱﾒﾅﾘｰﾌ錠200mg",{"$nulls":3},6,{"$nulls":3},6,null,null,"懸濁液がﾏｰｹﾞﾝﾁｭｰﾌﾞ内に滞留したﾃﾞｰﾀあり（16Fr なら簡易懸濁可）",null,null,"院内採用"]
["アメパロモカプセル250ｍｇ","ファイザー",null,"▲",6,{"$f":"IF(G69&H69&I69&I69&J69&K69=\"\",\"\",IF(G69&H69&I69&J69=\"\",K69,IF(G69&H69&I69=\"\",J69,(IF(G69&H69=\"\",I69,IF(G69=\"\",H69,G69))))))","v":6},6,null,6,null,null,"データなし　代用薬ないため主治医判断",null,"アメパロモカプセル250ｍｇ","院内採用"]
["アモキサンカプセル２５ｍｇ",null,null,"▲",1,{"$f":"IF(G70&H70&I70&I70&J70&K70=\"\",\"\",IF(G70&H70&I70&J70=\"\",K70,IF(G70&H70&I70=\"\",J70,(IF(G70&H70=\"\",I70,IF(G70=\"\",H70,G70))))))","v":1},null,1,{"$nulls":5},"アモキサンカプセル２５ｍｇ","院内採用"]
["アモキシシリンカプセル250ｍｇ「日医工」","日医工",null,"▲",1,{"$f":"IF(G71&H71&I71&I71&J71&K71=\"\",\"\",IF(G71&H71&I71&J71=\"\",K71,IF(G71&H71&I71=\"\",J71,(IF(G71&H71=\"\",I71,IF(G71=\"\",H71,G71))))))","v":1},null,1,{"$nulls":3},"内容物粒子が大きめで大量のため十分なフラッシュを",null,"アモキシシリンカプセル250ｍｇ「日医工」","院内採用"]
["アラバ錠10mg",{"$nulls":3},6,{"$nulls":3},6,null,null,"データなし　主治医と相談"]
["アリセプトＤ錠３ｍｇ",null,null,"▲",1,{"$f":"IF(G73&H73&I73&I73&J73&K73=\"\",\"\",IF(G73&H73&I73&J73=\"\",K73,IF(G73&H73&I73=\"\",J73,(IF(G73&H73=\"\",I73,IF(G73=\"\",H73,G73))))))","v":1},null,1,{"$nulls":5},"アリセプトＤ錠３ｍｇ"]
["アリセプトＤ錠５ｍｇ",null,null,"▲",1,1,null,1,{"$nulls":5},"アリセプトＤ錠５ｍｇ"]
["アリナミンＦ糖衣錠２５ｍｇ　",null,null,"▲",2,2,null,2,{"$nulls":5},"アリナミンＦ糖衣錠２５ｍｇ　"]
["アリミデックス錠　１ｍｇ","アストラゼネカ",null,"×",4,1,null,1,{"$nulls":3},"抗がん剤","単独投与　投与器具は毎回破棄　曝露に注意","アリミデックス錠　１ｍｇ"]
["アルケラン錠　２ｍｇ",null,null,"×",4,1,null,1,{"$nulls":3},"抗がん剤","冷所保存　単独投与　投与器具は毎回破棄　曝露に注意","アルケラン錠　２ｍｇ","院内採用"]
["アルサルミン細粒　９０％",{"$nulls":3},1,1,null,1,{"$nulls":5},"アルサルミン細粒　９０％"]
["アルダクトンＡ錠　２５ｍｇ　",null,null,"●",1,1,null,1,{"$nulls":5},"アルダクトンＡ錠　２５ｍｇ　"]
["アルドメット錠　２５０ｍｇ",null,null,"▲",1,1,null,1,{"$nulls":3},"ドパミン製剤のため酸化マグネシウム、鉄剤（フェネルミン等）と同時懸濁しない","酸化ﾏｸﾞﾈｼｳﾑ、鉄剤（フェネルミン等）と同時懸濁しない","アルドメット錠　２５０ｍｇ","院内採用"]
["アルファカルシドールカプセル0.25μｇ「トーワ」",{"$nulls":3},1,{"$nulls":3},1,{"$nulls":5},"院内採用"]
["アルファカルシドールカプセル1μｇ「トーワ」",{"$nulls":3},1,{"$nulls":3},1,{"$nulls":5},"院内採用"]
["アルファロール散　１μｇ／ｇ","中外",null,null,1,{"$f":"IF(G83&H83&I83&I83&J83&K83=\"\",\"\",IF(G83&H83&I83&J83=\"\",K83,IF(G83&H83&I83=\"\",J83,(IF(G83&H83=\"\",I83,IF(G83=\"\",H83,G83))))))","v":1},null,null,1,{"$nulls":4},"アルファロール散　１μｇ／ｇ","院内採用"]
["アルプラゾラム錠0.4mg「サワイ」",{"$nulls":3},1,{"$nulls":3},1,{"$nulls":5},"院内採用"]
["アレセンサカプセル20ｍｇ","中外",null,"×",4,{"$f":"IF(G85&H85&I85&I85&J85&K85=\"\",\"\",IF(G85&H85&I85&J85=\"\",K85,IF(G85&H85&I85=\"\",J85,(IF(G85&H85=\"\",I85,IF(G85=\"\",H85,G85))))))","v":1},null,null,1,null,null,"抗がん剤","単独投与　投与器具は毎回破棄　曝露に注意","アレセンサカプセル20ｍｇ","院内採用"]
["アレセンサカプセル40ｍｇ","中外",null,"×",4,{"$f":"IF(G86&H86&I86&I86&J86&K86=\"\",\"\",IF(G86&H86&I86&J86=\"\",K86,IF(G86&H86&I86=\"\",J86,(IF(G86&H86=\"\",I86,IF(G86=\"\",H86,G86))))))","v":1},null,null,1,null,null,"抗がん剤","単独投与　投与器具は毎回破棄　曝露に注意","アレセンサカプセル40ｍｇ","院内採用"]
["アレビアチン錠",{"$nulls":3},6,{"$nulls":3},6,null,null,"データーなし　アレビアチン散へ変更"]
["アレビアチン散１０％","大日本住友",null,null,1,{"$f":"IF(G88&H88&I88&I88&J88&K88=\"\",\"\",IF(G88&H88&I88&J88=\"\",K88,IF(G88&H88&I88=\"\",J88,(IF(G88&H88=\"\",I88,IF(G88=\"\",H88,G88))))))","v":1},{"$nulls":3},1,{"$nulls":3},"アレビアチン散１０％","院内採用"]
["アレロック顆粒０．５％","協和発酵キリン",null,null,6,{"$f":"IF(G89&H89&I89&I89&J89&K89=\"\",\"\",IF(G89&H89&I89&J89=\"\",K89,IF(G89&H89&I89=\"\",J89,(IF(G89&H89=\"\",I89,IF(G89=\"\",H89,G89))))))","v":6},null,null,6,null,null,"データなし　アレロックOD錠（同成分）へ変更　",null,"アレロック顆粒０．５％","院内採用"]
["アレンドロン酸錠35mg「日医工」",{"$nulls":3},4,{"$nulls":3},4,null,null,"頭部挙上状態で投与","頭部挙上状態で投与",null,"院内採用"]
["アロチノロール塩酸塩錠１０ｍｇ「ＤＳＰ」","大日本住友",null,"▲",1,{"$f":"IF(G91&H91&I91&I91&J91&K91=\"\",\"\",IF(G91&H91&I91&J91=\"\",K91,IF(G91&H91&I91=\"\",J91,(IF(G91&H91=\"\",I91,IF(G91=\"\",H91,G91))))))","v":1},null,1,{"$nulls":3},"溶けにくいため5分ぐらい長めに置くと通過",null,"アロチノロール塩酸塩錠１０ｍｇ「ＤＳＰ」","院内採用"]
["アロプリノール錠100ｍｇ「杏林」","杏林",null,"●",1,1,null,1,{"$nulls":5},"アロプリノール錠100ｍｇ「杏林」","院内採用"]
["アロマシン錠25ｍｇ","ファイザー",null,"×",4,1,null,1,{"$nulls":3},"抗がん剤","単独投与　投与器具は毎回破棄　曝露に注意","アロマシン錠25ｍｇ"]
["アンカロン錠100ｍｇ",null,null,"▲",1,1,null,1,{"$nulls":3},"多めの水でフラッシュ",null,"アンカロン錠100ｍｇ"]
["アンコチル錠500ｍｇ",null,null,"▲",1,1,null,1,{"$nulls":5},"アンコチル錠500ｍｇ","院内採用"]
["安息香酸ナトリウム原末「マルイシ」",{"$nulls":3},1,1,null,1,{"$nulls":5},"アンナカ「ヨシダ」","院内採用"]
["アンブロキソール塩酸塩錠15ｍｇ「サワイ」","沢井",null,"●",1,1,null,1,{"$nulls":5},"アンブロキソール塩酸塩錠15ｍｇ「サワイ」","院内採用"]
["アンブロキソール塩酸塩徐放OD錠45ｍｇ「サワイ」","沢井",null,"●",1,1,null,null,1,{"$nulls":4},"アンブロキソール塩酸塩徐放OD錠45ｍｇ「サワイ」","院内採用"]
["イーケプラDS50%","大塚製薬",null,null,1,1,null,null,1,{"$nulls":4},"イーケプラDS50%","院内採用"]
["イーケプラ錠250ｍｇ","Ｕ2Ｂ","大塚","●",2,2,null,2,{"$nulls":5},"イーケプラ錠250ｍｇ","院内採用"]
["イーケプラ錠500ｍｇ","Ｕ2Ｂ","大塚","▲",2,2,null,2,{"$nulls":5},"イーケプラ錠500ｍｇ","院内採用"]
["イグザレルト錠10ｍｇ","バイエル",null,"●",1,1,null,1,{"$nulls":5},"イグザレルト錠10ｍｇ","院内採用"]
["イグザレルト錠15ｍｇ","バイエル",null,"▲",1,1,null,1,{"$nulls":5},"イグザレルト錠15ｍｇ","院内採用"]
["イクスタンジ錠40ｍｇ","アステラス",null,"×",6,6,null,null,6,null,null,"抗がん剤/難水性の溶剤を充填　代用薬ないため主治医判断","単独投与　投与器具は毎回破棄　曝露に注意","イクスタンジカプセル40ｍｇ"]
["イクスタンジ錠80mg",{"$nulls":3},6,{"$nulls":3},6,null,null,"抗がん剤 8Frは通過できなかったが、10Frは通過できた。ﾁｭｰﾌﾞの口径を確認いただき、主従医と相談。","単剤投与　投与器具は毎回破棄　曝露に注意"]
["イコサペント酸エチル粒状カプセル９００ｍｇ　「サワイ」",{"$nulls":3},1,{"$f":"IF(G106&H106&I106&I106&J106&K106=\"\",\"\",IF(G106&H106&I106&J106=\"\",K106,IF(G106&H106&I106=\"\",J106,(IF(G106&H106=\"\",I106,IF(G106=\"\",H106,G106))))))","v":1},null,1,{"$nulls":5},"イコサペント酸エチル粒状カプセル９００ｍｇ　「サワイ」","院内採用"]
["イスコチン錠100ｍｇ",null,null,"●",1,{"$f":"IF(G107&H107&I107&I107&J107&K107=\"\",\"\",IF(G107&H107&I107&J107=\"\",K107,IF(G107&H107&I107=\"\",J107,(IF(G107&H107=\"\",I107,IF(G107=\"\",H107,G107))))))","v":1},null,1,{"$nulls":5},"イスコチン錠100ｍｇ","院内採用"]
["イスコチン末１００％　１００ｇ","第一三共",null,null,1,{"$f":"IF(G108&H108&I108&I108&J108&K108=\"\",\"\",IF(G108&H108&I108&J108=\"\",K108,IF(G108&H108&I108=\"\",J108,(IF(G108&H108=\"\",I108,IF(G108=\"\",H108,G108))))))","v":1},{"$nulls":3},1,{"$nulls":3},"イスコチン末１００％　１００ｇ"]
["イトラコナゾール錠100「ＭＥＥＫ」","Ｍｅｉｊｉ","小林化工","▲",2,{"$f":"IF(G109&H109&I109&I109&J109&K109=\"\",\"\",IF(G109&H109&I109&J109=\"\",K109,IF(G109&H109&I109=\"\",J109,(IF(G109&H109=\"\",I109,IF(G109=\"\",H109,G109))))))","v":2},null,null,2,{"$nulls":4},"イトラコナゾール錠100「ＭＥＥＫ」","院内採用"]
["イニシンク配合錠",{"$nulls":3},1,null,null,1,{"$nulls":3},"10分で崩壊というデータがあるため、溶けにくいとい問い合わせあれば、10分放置するよう説明。","通常より時間をかけて懸濁"]
["イノベロン錠200ｍｇ","エーザイ",null,"▲",1,{"$f":"IF(G111&H111&I111&I111&J111&K111=\"\",\"\",IF(G111&H111&I111&J111=\"\",K111,IF(G111&H111&I111=\"\",J111,(IF(G111&H111=\"\",I111,IF(G111=\"\",H111,G111))))))","v":1},null,null,1,null,null,"沈殿性浮遊物あるが8Fr.通過",null,"イノベロン錠200ｍｇ"]
["イブランスカプセル125mg",{"$nulls":3},6,{"$nulls":3},6,null,null,"データなし　抗がん剤","単独投与　投与器具は毎回破棄　曝露に注意"]
["イブランスカプセル25mg",{"$nulls":3},6,{"$nulls":3},6,null,null,"データなし　抗がん剤","単独投与　投与器具は毎回破棄　曝露に注意"]
["イミグラン錠５０","グラクソ",null,"▲",1,{"$f":"IF(G114&H114&I114&I114&J114&K114=\"\",\"\",IF(G114&H114&I114&J114=\"\",K114,IF(G114&H114&I114=\"\",J114,(IF(G114&H114=\"\",I114,IF(G114=\"\",H114,G114))))))","v":1},null,1,1,{"$nulls":4},"イミグラン錠５０"]
["イミダフェナシンOD錠0.1mg「杏林」",{"$nulls":3},1,{"$nulls":3},1,{"$nulls":5},"院内採用"]
["イミダプリル塩酸塩錠5mg「日医工」",{"$nulls":3},2,{"$nulls":3},2,{"$nulls":5},"院内採用"]
["イムセラカプセル0.5ｍｇ","田辺三菱",null,"×",6,{"$f":"IF(G117&H117&I117&I117&J117&K117=\"\",\"\",IF(G117&H117&I117&J117=\"\",K117,IF(G117&H117&I117=\"\",J117,(IF(G117&H117=\"\",I117,IF(G117=\"\",H117,G117))))))","v":6},6,null,6,null,null,"データなし　原薬は水に溶けやすい　代用薬ないため主治医判断",null,"イムセラカプセル0.5ｍｇ","院内採用"]
["イムブルビカカプセル140mg",{"$nulls":3},6,{"$nulls":3},6,null,null,"データなし 抗がん剤 代用薬ないため主治医判断　","単独投与　投与器具は毎回破棄　曝露に注意 "]
["イムラン錠50ｍｇ",null,null,"▲",1,{"$f":"IF(G119&H119&I119&I119&J119&K119=\"\",\"\",IF(G119&H119&I119&J119=\"\",K119,IF(G119&H119&I119=\"\",J119,(IF(G119&H119=\"\",I119,IF(G119=\"\",H119,G119))))))","v":1},null,1,{"$nulls":3},"多めの水でフラッシュ",null,"イムラン錠50ｍｇ","院内採用"]
["イメンドカプセル 80ｍｇ","小野",null,"×",6,{"$f":"IF(G120&H120&I120&I120&J120&K120=\"\",\"\",IF(G120&H120&I120&J120=\"\",K120,IF(G120&H120&I120=\"\",J120,(IF(G120&H120=\"\",I120,IF(G120=\"\",H120,G120))))))","v":6},6,{"$nulls":4},"データなし　プロイメンド注（同成分）へ変更　",null,"イメンドカプセル 80ｍｇ"]
["イメンドカプセル125ｍｇ","小野",null,"×",6,{"$f":"IF(G121&H121&I121&I121&J121&K121=\"\",\"\",IF(G121&H121&I121&J121=\"\",K121,IF(G121&H121&I121=\"\",J121,(IF(G121&H121=\"\",I121,IF(G121=\"\",H121,G121))))))","v":6},6,{"$nulls":4},"データなし　プロイメンド注（同成分）へ変更　",null,"イメンドカプセル125ｍｇ"]
["イリボーOD錠2.5μｇ",{"$nulls":3},1,{"$nulls":3},1]
["イリボーＯＤ錠５μｇ","アステラス",null,"▲",1,{"$f":"IF(G123&H123&I123&I123&J123&K123=\"\",\"\",IF(G123&H123&I123&J123=\"\",K123,IF(G123&H123&I123=\"\",J123,(IF(G123&H123=\"\",I123,IF(G123=\"\",H123,G123))))))","v":1},null,null,1,null,null,"ガラス容器だと吸着",null,"イリボーＯＤ錠５μｇ"]
["イルソグラジンマレイン酸塩錠　４ｍｇ「日医工」",{"$nulls":3},1,{"$nulls":5},1,{"$nulls":3},"院内採用"]
["イレッサ錠２５０","アストラゼネカ",null,"×",4,{"$f":"IF(G125&H125&I125&I125&J125&K125=\"\",\"\",IF(G125&H125&I125&J125=\"\",K125,IF(G125&H125&I125=\"\",J125,(IF(G125&H125=\"\",I125,IF(G125=\"\",H125,G125))))))","v":1},null,1,{"$nulls":3},"抗がん剤","単独投与　投与器具は毎回破棄　曝露に注意","イレッサ錠２５０"]
["インタール細粒１０％","サノフィ",null,null,1,{"$f":"IF(G126&H126&I126&I126&J126&K126=\"\",\"\",IF(G126&H126&I126&J126=\"\",K126,IF(G126&H126&I126=\"\",J126,(IF(G126&H126=\"\",I126,IF(G126=\"\",H126,G126))))))","v":1},{"$nulls":3},1,{"$nulls":3},"インタール細粒１０％"]
["インチュニブ錠1mg",{"$nulls":3},6,{"$nulls":3},6,null,null,"データなし　代用薬ないため主治医判断"]
["インチュニブ錠3mg",{"$nulls":3},6,{"$nulls":3},6,null,null,"データなし　代用薬ないため主治医判断"]
["インデラル錠１０ｍｇ",null,null,"▲",1,{"$f":"IF(G129&H129&I129&I129&J129&K129=\"\",\"\",IF(G129&H129&I129&J129=\"\",K129,IF(G129&H129&I129=\"\",J129,(IF(G129&H129=\"\",I129,IF(G129=\"\",H129,G129))))))","v":1},null,1,{"$nulls":3},"多めの水でフラッシュ",null,"インデラル錠１０ｍｇ","院内採用"]
["インフリーＳカプセル２００ｍｇ",null,null,"▲",6,{"$f":"IF(G130&H130&I130&I130&J130&K130=\"\",\"\",IF(G130&H130&I130&J130=\"\",K130,IF(G130&H130&I130=\"\",J130,(IF(G130&H130=\"\",I130,IF(G130=\"\",H130,G130))))))","v":6},null,6,{"$nulls":3},"データなし　他のNSAIDsへ変更",null,"インフリーＳカプセル２００ｍｇ"]
["インライタ錠１ｍｇ","ファイザー",null,"×",6,{"$f":"IF(G131&H131&I131&I131&J131&K131=\"\",\"\",IF(G131&H131&I131&J131=\"\",K131,IF(G131&H131&I131=\"\",J131,(IF(G131&H131=\"\",I131,IF(G131=\"\",H131,G131))))))","v":6},{"$nulls":3},6,null,"データなし　抗がん剤　代用薬ないため主治医判断　","単独投与　投与器具は毎回破棄　曝露に注意","インライタ錠１ｍｇ"]
["インライタ錠５ｍｇ","ファイザー",null,"×",6,{"$f":"IF(G132&H132&I132&I132&J132&K132=\"\",\"\",IF(G132&H132&I132&J132=\"\",K132,IF(G132&H132&I132=\"\",J132,(IF(G132&H132=\"\",I132,IF(G132=\"\",H132,G132))))))","v":6},{"$nulls":3},6,null,"データなし　抗がん剤　代用薬ないため主治医判断　","単独投与　投与器具は毎回破棄　曝露に注意","インライタ錠５ｍｇ"]
["ヴァイデックスＥＣカプセル１２５　","ブリストルマイヤーズ",null,"×",6,{"$f":"IF(G133&H133&I133&I133&J133&K133=\"\",\"\",IF(G133&H133&I133&J133=\"\",K133,IF(G133&H133&I133=\"\",J133,(IF(G133&H133=\"\",I133,IF(G133=\"\",H133,G133))))))","v":6},null,6,{"$nulls":3},"データなし　HIV　HIV担当者に相談 ","投与方法は要相談","ヴアイデックスＥＣカプセル１２５　"]
["ヴィキラックス配合錠",{"$nulls":3},6,{"$nulls":3},6,null,null,"データーなし　代用薬ないため主治医判断"]
["ヴォトリエント錠200ｍｇ","グラクソ",null,"×",6,{"$f":"IF(G135&H135&I135&I135&J135&K135=\"\",\"\",IF(G135&H135&I135&J135=\"\",K135,IF(G135&H135&I135=\"\",J135,(IF(G135&H135=\"\",I135,IF(G135=\"\",H135,G135))))))","v":6},null,null,6,null,null,"抗がん剤/粉砕するとＣmax/AUＣ増加する　代用薬ないため主治医判断","単独投与　投与器具は毎回破棄　曝露に注意","ヴォトリエント錠200ｍｇ","院内採用"]
["ウ゛ォリブリス錠2.5mg",{"$nulls":3},6,{"$nulls":3},6,null,null,"データなし　錠剤粉砕可"]
["ウチダの八味丸M",{"$nulls":3},6,{"$nulls":3},6,null,null,"水に溶けない。必要であればDrと要相談（エキス製剤なら投与可）"]
["ウテメリン　５ｍｇ　",null,null,"▲",1,{"$f":"IF(G138&H138&I138&I138&J138&K138=\"\",\"\",IF(G138&H138&I138&J138=\"\",K138,IF(G138&H138&I138=\"\",J138,(IF(G138&H138=\"\",I138,IF(G138=\"\",H138,G138))))))","v":1},null,1,{"$nulls":5},"ウテメリン　５ｍｇ　","院内採用"]
["ウプトラビ錠0.2mg",{"$nulls":3},2,{"$nulls":3},2]
["ウブレチド錠　５ｍｇ",null,null,"▲",1,{"$f":"IF(G140&H140&I140&I140&J140&K140=\"\",\"\",IF(G140&H140&I140&J140=\"\",K140,IF(G140&H140&I140=\"\",J140,(IF(G140&H140=\"\",I140,IF(G140=\"\",H140,G140))))))","v":1},null,1,{"$nulls":5},"ウブレチド錠　５ｍｇ","院内採用"]
["ウラリット配合錠",null,null,"●",2,2,null,2,{"$nulls":5},"ウラリット配合錠","院内採用"]
["ウリトスＯＤ錠　０．１ｍｇ","杏林",null,"▲",1,1,null,null,1,{"$nulls":4},"ウリトスＯＤ錠　０．１ｍｇ"]
["ウルソデオキシコール酸錠100mg「トーワ」",null,null,"●",1,1,null,null,1,{"$nulls":5},"院内採用"]
["ウルソ錠１００ｍｇ",null,null,"●",1,1,null,1,{"$nulls":5},"ウルソ錠１００ｍｇ"]
["ウロカルン錠２２５ｍｇ",null,null,"▲",6,6,null,6,{"$nulls":3},"データなし　錠剤粉砕可",null,"ウロカルン錠２２５ｍｇ","院内採用"]
["エクア錠　５０ｍｇ","ノバルティス",null,"●",1,1,{"$nulls":3},1,null,null,"血糖降下薬","エクア錠　５０ｍｇ","院内採用"]
["エクジェイド懸濁用５００ｍｇ","ノバルティス",null,"×",6,6,6,{"$nulls":4},"水100mLで懸濁して内服する製剤　簡易懸濁対象外",null,"エクジェイド懸濁用５００ｍｇ"]
["エクセグラン散　２０％",{"$nulls":3},1,1,null,1,{"$nulls":5},"エクセグラン散　２０％"]
["エクセグラン錠１００ｍｇ",null,null,"▲",1,1,null,1,{"$nulls":5},"エクセグラン錠１００ｍｇ","院内採用"]
["エクセラーゼ配合錠",{"$nulls":3},6,null,null,6,{"$nulls":3},"データなし　腸溶性が失活するため粉砕不適 代用薬ないため主治医判断"]
["エクフィナ錠50mg",{"$nulls":3},2,{"$nulls":3},2]
["エクメットLD配合錠",{"$nulls":3},6,{"$nulls":3},6,null,null,"データなし　当院採用の同効薬（エクア錠50mg＋メトグルコ錠250mg）へ変更。","血糖降下薬"]
["エジュラント錠25ｍｇ","ヤンセン",null,"×",6,{"$f":"IF(G153&H153&I153&I153&J153&K153=\"\",\"\",IF(G153&H153&I153&J153=\"\",K153,IF(G153&H153&I153=\"\",J153,(IF(G153&H153=\"\",I153,IF(G153=\"\",H153,G153))))))","v":6},6,{"$nulls":4},"HIV/固形物摂取が必要　HIV担当者に相談","投与方法は要相談","エジュラント錠25ｍｇ","院内採用"]
["エスカゾール錠200ｍｇ","グラクソ",null,"▲",1,{"$f":"IF(G154&H154&I154&I154&J154&K154=\"\",\"\",IF(G154&H154&I154&J154=\"\",K154,IF(G154&H154&I154=\"\",J154,(IF(G154&H154=\"\",I154,IF(G154=\"\",H154,G154))))))","v":1},null,null,1,{"$nulls":4},"エスカゾール錠200ｍｇ"]
["エストラサイトカプセル　１５６．７ｍｇ","日新",null,"×",4,{"$f":"IF(G155&H155&I155&I155&J155&K155=\"\",\"\",IF(G155&H155&I155&J155=\"\",K155,IF(G155&H155&I155=\"\",J155,(IF(G155&H155=\"\",I155,IF(G155=\"\",H155,G155))))))","v":1},null,1,{"$nulls":3},"抗がん剤","冷所保存　単独投与　投与器具は毎回破棄　曝露に注意","エストラサイトカプセル　１５６．７ｍｇ"]
["エスワンタイホウ配合錠OD錠T20",{"$nulls":3},4,{"$nulls":3},4,null,null,"抗がん剤","単独投与　投与器具は毎回破棄　曝露に注意",null,"院内採用"]
["エスワンタイホウ配合錠OD錠T25",{"$nulls":3},4,{"$nulls":3},4,null,null,"抗がん剤","単独投与　投与器具は毎回破棄　曝露に注意",null,"院内採用"]
["エゼチミブ錠10mg「DSEP」",{"$nulls":3},1,{"$nulls":3},1,null,null,"オーソライズドジェネリックのため先発と同一",null,null,"院内採用"]
["エチゾラム錠0.5ｍｇ「ＥＭＥC」",null,null,"●",1,{"$f":"IF(G159&H159&I159&I159&J159&K159=\"\",\"\",IF(G159&H159&I159&J159=\"\",K159,IF(G159&H159&I159=\"\",J159,(IF(G159&H159=\"\",I159,IF(G159=\"\",H159,G159))))))","v":1},null,1,{"$nulls":5},"エチゾラム錠0.5ｍｇ「ＥＭＥC」","院内採用"]
["エディロールカプセル０．７５μｇ","中外",null,"▲",6,6,null,null,6,null,null,"データなし　ｱﾙﾌｧｶﾙｼﾄﾞｰﾙｶﾌﾟｾﾙ（同効）へ変更",null,"エディロールカプセル０．７５μｇ","院内採用"]
["エナラプリルＭ錠５「ＥＭＥC」","エルドメットエーザイ",null,"●",1,1,null,null,1,{"$nulls":4},"エナラプリルＭ錠５「ＥＭＥC」","院内採用"]
["エバステル錠１０ｍｇ","大日本住友",null,"▲",1,1,null,1,1,null,null,"常温の水で懸濁","常温の水で懸濁","エバステル錠１０ｍｇ","院内採用"]
["エピビル錠　１５０ｍｇ","グラクソ",null,"×",4,1,null,1,1,null,null,"HIV",null,"エピビル錠　１５０ｍｇ","院内採用"]
["エビプロスタット配合錠ＤＢ",null,null,"▲",6,6,null,6,{"$nulls":3},"腸溶コーティングが詰まる　原薬の味とにおいをマスクするためと胃酸で失活するかしないかわからないため腸溶になっている　代用薬ないため主治医判断",null,"エビプロスタット配合錠ＤＢ"]
["エビリファイ散1%","ファイザ-",null,null,1,1,1,{"$nulls":4},"散のデータはないが錠はハンドブックで可　散を固める際に添加物を加えて錠を形成しているとメーカーより→可と判断",null,"硫酸ポリミキシンＢ錠100万単位"]
["エフィエントOD錠20mg",{"$nulls":3},1,null,null,1,{"$nulls":3},"55度でも溶けるが、安定性が悪いため常温の水で投与","常温の水で懸濁",null,"院内採用"]
["エフィエント錠　２０ｍｇ",{"$nulls":3},1,{"$nulls":5},1,"メーカーより30℃10分はOK（30分おくのは不可）55℃10分放置は類縁物質増加→常温の水で実験してOK","常温の水で懸濁"]
["エフィエント錠3.75ｍｇ","第一三共",null,"●",1,{"$f":"IF(G168&H168&I168&I168&J168&K168=\"\",\"\",IF(G168&H168&I168&J168=\"\",K168,IF(G168&H168&I168=\"\",J168,(IF(G168&H168=\"\",I168,IF(G168=\"\",H168,G168))))))","v":1},{"$nulls":4},1,"メーカーより30℃10分はOK（30分おくのは不可）55℃10分放置は類縁物質増加→常温の水で実験してOK","常温の水で懸濁","エフィエント錠3.75ｍｇ","院内採用"]
["エフィエント錠5ｍｇ","第一三共",null,"▲",1,{"$f":"IF(G169&H169&I169&I169&J169&K169=\"\",\"\",IF(G169&H169&I169&J169=\"\",K169,IF(G169&H169&I169=\"\",J169,(IF(G169&H169=\"\",I169,IF(G169=\"\",H169,G169))))))","v":1},{"$nulls":4},1,"メーカーより30℃10分はOK（30分おくのは不可）55℃10分放置は類縁物質増加→常温の水で実験してOK","常温の水で懸濁","エフィエント錠5ｍｇ"]
["エプクルーサ配合錠",{"$nulls":3},6,{"$nulls":3},6,null,null,"データなし　代替薬ないため主治医と相談"]
["エプジコム錠","ヴィーブ",null,"×",3,{"$f":"IF(G171&H171&I171&I171&J171&K171=\"\",\"\",IF(G171&H171&I171&J171=\"\",K171,IF(G171&H171&I171=\"\",J171,(IF(G171&H171=\"\",I171,IF(G171=\"\",H171,G171))))))","v":2},null,2,{"$nulls":3},"HIV",null,"エプジコム錠","院内採用"]
["エブトール２５０ｍｇ錠　",null,null,"●",6,{"$f":"IF(G172&H172&I172&I172&J172&K172=\"\",\"\",IF(G172&H172&I172&J172=\"\",K172,IF(G172&H172&I172=\"\",J172,(IF(G172&H172=\"\",I172,IF(G172=\"\",H172,G172))))))","v":6},null,6,{"$nulls":3},"データなし　錠剤粉砕可",null,"エブトール２５０ｍｇ錠　","院内採用"]
["エフピ－ＯＤ錠２．５ｍｇ","エフピー",null,"×",4,{"$f":"IF(G173&H173&I173&I173&J173&K173=\"\",\"\",IF(G173&H173&I173&J173=\"\",K173,IF(G173&H173&I173=\"\",J173,(IF(G173&H173=\"\",I173,IF(G173=\"\",H173,G173))))))","v":1},null,null,1,null,null,"覚せい剤原料","単独投与　投与器具は毎回破棄　曝露に注意","エフピ－ＯＤ錠２．５ｍｇ"]
["エブランチルカプセル１５ｍｇ　",null,null,"▲",6,{"$f":"IF(G174&H174&I174&I174&J174&K174=\"\",\"\",IF(G174&H174&I174&J174=\"\",K174,IF(G174&H174&I174=\"\",J174,(IF(G174&H174=\"\",I174,IF(G174=\"\",H174,G174))))))","v":6},null,6,{"$nulls":3},"簡易懸濁法では多めの水でフラッシュすれば14Fr.通過　脱カプセルして投与可能",null,"エブランチルカプセル１５ｍｇ　","院内採用"]
["エペリゾン塩酸塩錠50μg「トーワ」",{"$nulls":3},2,{"$nulls":3},2,{"$nulls":5},"院内採用"]
["エリキュース錠（2.5ｍｇ）","ブリストルマイヤーズ",null,"●",1,{"$f":"IF(G176&H176&I176&I176&J176&K176=\"\",\"\",IF(G176&H176&I176&J176=\"\",K176,IF(G176&H176&I176=\"\",J176,(IF(G176&H176=\"\",I176,IF(G176=\"\",H176,G176))))))","v":1},null,1,{"$nulls":5},"エリキュース錠（2.5ｍｇ）","院内採用"]
["エリキュース錠（5ｍｇ）","ブリストルマイヤーズ",null,"●",1,{"$f":"IF(G177&H177&I177&I177&J177&K177=\"\",\"\",IF(G177&H177&I177&J177=\"\",K177,IF(G177&H177&I177=\"\",J177,(IF(G177&H177=\"\",I177,IF(G177=\"\",H177,G177))))))","v":1},null,1,{"$nulls":5},"エリキュース錠（5ｍｇ）","院内採用"]
["エリスロシンドライシロップ10%","アボット",null,null,1,{"$f":"IF(G178&H178&I178&I178&J178&K178=\"\",\"\",IF(G178&H178&I178&J178=\"\",K178,IF(G178&H178&I178=\"\",J178,(IF(G178&H178=\"\",I178,IF(G178=\"\",H178,G178))))))","v":1},1,{"$nulls":4},"簡易懸濁データなし","単独投与　常温の水で懸濁","エリスロシンドライシロップ10%","院内採用"]
["エリスロシン錠（２００ｍｇ）",null,null,"▲",2,{"$f":"IF(G179&H179&I179&I179&J179&K179=\"\",\"\",IF(G179&H179&I179&J179=\"\",K179,IF(G179&H179&I179=\"\",J179,(IF(G179&H179=\"\",I179,IF(G179=\"\",H179,G179))))))","v":2},null,2,{"$nulls":5},"エリスロシン錠（２００ｍｇ）","院内採用"]
["エルカルチンFF錠１００ｍｇ","大塚",null,"×",3,{"$f":"IF(G180&H180&I180&I180&J180&K180=\"\",\"\",IF(G180&H180&I180&J180=\"\",K180,IF(G180&H180&I180=\"\",J180,(IF(G180&H180=\"\",I180,IF(G180=\"\",H180,G180))))))","v":2},null,null,2,{"$nulls":4},"エルカルチンFF錠１００ｍｇ","院内採用"]
["エルサメットS配合錠",{"$nulls":3},6,{"$nulls":3},6,null,null,"腸溶錠のため不可　代替薬はないため主治医と相談",null,null,"院内採用"]
["エレルサ錠　50mg",{"$nulls":3},6,{"$nulls":3},6,null,null,"データなし  Drと要相談"]
["塩化ナトリウム","大塚製薬工場",null,null,1,{"$f":"IF(G183&H183&I183&I183&J183&K183=\"\",\"\",IF(G183&H183&I183&J183=\"\",K183,IF(G183&H183&I183=\"\",J183,(IF(G183&H183=\"\",I183,IF(G183=\"\",H183,G183))))))","v":1},{"$nulls":4},1,"他剤と同時に溶解すると塩析が起こるため単独で溶解して投与","単独投与　溶解は55℃温水でも常温の水でも可","塩化ナトリウム","院内採用"]
["エンテカビルOD0.5mg",{"$nulls":3},1,{"$nulls":3},1,{"$nulls":5},"院内採用"]
["エンドキサン錠　５０ｍｇ",null,null,"×",6,{"$f":"IF(G185&H185&I185&I185&J185&K185=\"\",\"\",IF(G185&H185&I185&J185=\"\",K185,IF(G185&H185&I185=\"\",J185,(IF(G185&H185=\"\",I185,IF(G185=\"\",H185,G185))))))","v":6},null,6,{"$nulls":3},"データなし　抗がん剤　代用薬ないため主治医判断","単独投与　投与器具は毎回破棄　曝露に注意","エンドキサン錠　５０ｍｇ"]
["オイグルコン錠１．２５ｍｇ","中外",null,"▲",1,{"$f":"IF(G186&H186&I186&I186&J186&K186=\"\",\"\",IF(G186&H186&I186&J186=\"\",K186,IF(G186&H186&I186=\"\",J186,(IF(G186&H186=\"\",I186,IF(G186=\"\",H186,G186))))))","v":1},null,1,{"$nulls":4},"血糖降下薬","オイグルコン錠１．２５ｍｇ","院内採用"]
["オーグメンチン配合錠２５０ＲＳ　（３７５ｍｇ）","グラクソ",null,"×",6,{"$f":"IF(G187&H187&I187&I187&J187&K187=\"\",\"\",IF(G187&H187&I187&J187=\"\",K187,IF(G187&H187&I187=\"\",J187,(IF(G187&H187=\"\",I187,IF(G187=\"\",H187,G187))))))","v":6},null,6,6,null,null,"データなし　吸湿性強く粉砕も不可（常温保存で7日後著しい力価低下）　他院では簡易懸濁可としているデータもあるが力価変化は不明　主治医と相談",null,"オーグメンチン配合錠２５０ＲＳ　（３７５ｍｇ）","院内採用"]
["オキシコンチンＴＲ錠20mg",{"$nulls":3},6,{"$nulls":3},6]
["オキシコンチンＴＲ錠5mg",{"$nulls":3},6,{"$nulls":3},6]
["オ－クル錠　１００ｍｇ",null,null,"▲",2,{"$f":"IF(G190&H190&I190&I190&J190&K190=\"\",\"\",IF(G190&H190&I190&J190=\"\",K190,IF(G190&H190&I190=\"\",J190,(IF(G190&H190=\"\",I190,IF(G190=\"\",H190,G190))))))","v":2},null,2,{"$nulls":5},"オ－クル錠　１００ｍｇ"]
["オゼックス細粒小児用１５％","大正富山",null,null,1,{"$f":"IF(G191&H191&I191&I191&J191&K191=\"\",\"\",IF(G191&H191&I191&J191=\"\",K191,IF(G191&H191&I191=\"\",J191,(IF(G191&H191=\"\",I191,IF(G191=\"\",H191,G191))))))","v":1},null,null,1,null,null,"データないが水に溶解するためOKと思われる",null,"オゼックス細粒小児用１５％","院内採用"]
["オセルタミビルカプセル75mg「サワイ」",{"$nulls":3},4,{"$nulls":3},1,{"$nulls":5},"院内採用"]
["オダイン錠　１２５ｍｇ","日本化薬",null,"×",6,{"$f":"IF(G193&H193&I193&I193&J193&K193=\"\",\"\",IF(G193&H193&I193&J193=\"\",K193,IF(G193&H193&I193=\"\",J193,(IF(G193&H193=\"\",I193,IF(G193=\"\",H193,G193))))))","v":6},null,6,6,null,null,"データなし　抗がん剤　　時間をかければ通過するかも（ハンドブック）　代用薬ないため主治医判断","単独投与　投与器具は毎回破棄　曝露に注意","オダイン錠　１２５ｍｇ"]
["オテズラ錠10mg",{"$nulls":3},6,{"$nulls":3},6,null,null,"データなし　主治医と相談"]
["オテズラ錠20mg",{"$nulls":3},6,{"$nulls":3},6,null,null,"データなし　主治医と相談"]
["オテズラ錠30mg",{"$nulls":3},6,{"$nulls":3},6,null,null,"データなし　主治医と相談"]
["オノンドライシロップ10%","小野薬品",null,null,1,{"$f":"IF(G197&H197&I197&I197&J197&K197=\"\",\"\",IF(G197&H197&I197&J197=\"\",K197,IF(G197&H197&I197=\"\",J197,(IF(G197&H197=\"\",I197,IF(G197=\"\",H197,G197))))))","v":1},1,{"$nulls":4},"プランルカスト錠は懸濁可/簡易懸濁データなし","単独投与　常温の水で懸濁","オノンドライシロップ10%","院内採用"]
["オフェブカプセル100mg",{"$nulls":3},6,{"$nulls":3},6,null,null,"データーなし　抗がん剤 代用薬ないため主治医判断","単独投与　投与器具は毎回破棄　曝露に注意"]
["オフェブカプセル150mg",{"$nulls":3},6,{"$nulls":3},6,null,null,"データーなし　抗がん剤 代用薬ないため主治医判断","単独投与　投与器具は毎回破棄　曝露に注意",null,"院内採用"]
["オプスミット錠10mg",{"$nulls":3},1,{"$nulls":3},1,{"$nulls":5},"院内採用"]
["オラセフ錠　２５０ｍｇ",null,null,"×",4,{"$f":"IF(G201&H201&I201&I201&J201&K201=\"\",\"\",IF(G201&H201&I201&J201=\"\",K201,IF(G201&H201&I201=\"\",J201,(IF(G201&H201=\"\",I201,IF(G201=\"\",H201,G201))))))","v":1},null,1,{"$nulls":5},"オラセフ錠　２５０ｍｇ"]
["オランザピンOD錠2.5mg「明治」",{"$nulls":3},1,{"$nulls":3},1,{"$nulls":5},"院内採用"]
["オルケディア錠1mg",{"$nulls":3},1,{"$nulls":3},1,{"$nulls":5},"院内採用"]
["オルケディア錠2mg　",{"$nulls":3},1,{"$nulls":3},1]
["オルミエント錠2mg",{"$nulls":3},6,{"$nulls":3},6,null,null,"データなし　主治医と相談"]
["ｵﾙﾐｴﾝﾄ錠4mg",{"$nulls":3},6,{"$nulls":3},6,null,null,"データなし　主治医と相談"]
["オルメサルタンOD錠20mg「DSEP」",{"$nulls":3},1,{"$nulls":3},1,{"$nulls":5},"院内採用"]
["オルメテックOD錠20mg",{"$nulls":3},1,{"$nulls":3},1]
["オルメテック錠２０ｍｇ","第一三共",null,"●",1,{"$f":"IF(G209&H209&I209&I209&J209&K209=\"\",\"\",IF(G209&H209&I209&J209=\"\",K209,IF(G209&H209&I209=\"\",J209,(IF(G209&H209=\"\",I209,IF(G209=\"\",H209,G209))))))","v":1},null,null,1,{"$nulls":4},"オルメテック錠２０ｍｇ"]
["オロパタジン塩酸塩ＯＤ錠5ｍｇ「明治」","Ｍｅｉｊｉ",null,"●",1,1,null,1,{"$nulls":5},"オロパタジン塩酸塩ＯＤ錠5ｍｇ「明治」","院内採用"]
["カイトリル錠２ｍｇ",null,null,"×",4,1,null,1,{"$nulls":3},"1mｇ参照",null,"カイトリル錠２ｍｇ"]
["ガスター散１０％　１００g","アステラス",null,null,1,1,{"$nulls":3},1,{"$nulls":3},"ガスター散１０％　１００g","院内採用"]
["ガストローム顆粒　６６．７％",{"$nulls":3},6,6,null,6,{"$nulls":3},"データなし　ムコスタ顆粒（同効）・セルベックス（同効）へ変更",null,"ガストローム顆粒　６６．７％"]
["ガスロンＮ錠４ｍｇ　",null,null,"●",1,1,null,1,{"$nulls":5},"ガスロンＮ錠４ｍｇ　"]
["カソデックスＯＤ錠８０ｍｇ",null,null,"×",4,1,{"$nulls":3},1,null,"抗がん剤","単独投与　投与器具は毎回破棄　曝露に注意","カソデックスＯＤ錠８０ｍｇ"]
["カタプレス錠７５　０．０７５ｍｇ",null,null,"×",4,1,null,1,{"$nulls":5},"カタプレス錠７５　０．０７５ｍｇ","院内採用"]
["カチーフＮ錠５ｍｇ","武田",null,"▲",1,1,{"$nulls":3},1,{"$nulls":3},"カチーフＮ錠５ｍｇ","院内採用"]
["カナグル錠100mg",{"$nulls":3},2,null,null,2,2,{"$nulls":3},"血糖降下薬",null,"院内採用"]
["ガナトン錠５０ｍｇ",null,null,"●",2,{"$f":"IF(G219&H219&I219&I219&J219&K219=\"\",\"\",IF(G219&H219&I219&J219=\"\",K219,IF(G219&H219&I219=\"\",J219,(IF(G219&H219=\"\",I219,IF(G219=\"\",H219,G219))))))","v":2},null,2,{"$nulls":5},"ガナトン錠５０ｍｇ","院内採用"]
["カナマイシンカプセル250mg「明治」",{"$nulls":3},1,null,null,1,{"$nulls":6},"院内採用"]
["カナリア配合錠",{"$nulls":3},1,{"$nulls":3},1,{"$nulls":3},"血糖降下薬"]
["カバサ－ル錠　１ｍｇ",null,null,"×",4,{"$f":"IF(G222&H222&I222&I222&J222&K222=\"\",\"\",IF(G222&H222&I222&J222=\"\",K222,IF(G222&H222&I222=\"\",J222,(IF(G222&H222=\"\",I222,IF(G222=\"\",H222,G222))))))","v":4},null,4,{"$nulls":5},"カバサ－ル錠　１ｍｇ"]
["ガバペン錠２００ｍｇ","ファイザー",null,"▲",2,{"$f":"IF(G223&H223&I223&I223&J223&K223=\"\",\"\",IF(G223&H223&I223&J223=\"\",K223,IF(G223&H223&I223=\"\",J223,(IF(G223&H223=\"\",I223,IF(G223=\"\",H223,G223))))))","v":2},null,null,2,null,null,"120mlのフラッシュで残留無し",null,"ガバペン錠２００ｍｇ"]
["ガバペン錠３００ｍｇ","ファイザー",null,"▲",2,{"$f":"IF(G224&H224&I224&I224&J224&K224=\"\",\"\",IF(G224&H224&I224&J224=\"\",K224,IF(G224&H224&I224=\"\",J224,(IF(G224&H224=\"\",I224,IF(G224=\"\",H224,G224))))))","v":2},null,null,2,null,null,"180ｍｌのフラッシュで残留無し",null,"ガバペン錠３００ｍｇ"]
["カプトリル錠１２．５ｍｇ","第一三共エスファ",null,"▲",1,{"$f":"IF(G225&H225&I225&I225&J225&K225=\"\",\"\",IF(G225&H225&I225&J225=\"\",K225,IF(G225&H225&I225=\"\",J225,(IF(G225&H225=\"\",I225,IF(G225=\"\",H225,G225))))))","v":1},{"$nulls":3},1,{"$nulls":3},"カプトリル錠１２．５ｍｇ","院内採用"]
["カペシタビン錠300mg「サワイ」",{"$nulls":3},4,{"$nulls":3},4,null,null,"抗がん剤","25分待ってから注入　　　　　　　　　　　　　　　　　　　単独投与　投与器具は毎回破棄　曝露に注意",null,"院内採用"]
["カベルゴリン錠0.25mg「サワイ」",{"$nulls":3},1,{"$nulls":3},1,{"$nulls":5},"院内採用"]
["カモスタットメシル酸塩錠100mg「サワイ」",{"$nulls":3},1,{"$nulls":3},1,{"$nulls":5},"院内採用"]
["ガランターゼ散　５０％　０．５g","田辺製薬販売",null,null,1,{"$f":"IF(G229&H229&I229&I229&J229&K229=\"\",\"\",IF(G229&H229&I229&J229=\"\",K229,IF(G229&H229&I229=\"\",J229,(IF(G229&H229=\"\",I229,IF(G229=\"\",H229,G229))))))","v":1},1,{"$nulls":4},"酵素製剤であり55℃では失活　水で投与","常温の水で懸濁","ガランターゼ散　５０％　０．５g","院内採用"]
["カリセラムNa末",{"$nulls":3},1,{"$nulls":3},1,null,null,"2.5gあたり水20mLで懸濁し直後に注入（10分放置しない)\n","2.5gあたり水20mLで懸濁しすぐに注入"]
["カルグート錠　５ｍｇ",null,null,"▲",1,{"$f":"IF(G231&H231&I231&I231&J231&K231=\"\",\"\",IF(G231&H231&I231&J231=\"\",K231,IF(G231&H231&I231=\"\",J231,(IF(G231&H231=\"\",I231,IF(G231=\"\",H231,G231))))))","v":1},null,1,{"$nulls":5},"カルグート錠　５ｍｇ"]
["カルタンＯＤ錠５００ｍｇ","マイラン",null,"●",1,{"$f":"IF(G232&H232&I232&I232&J232&K232=\"\",\"\",IF(G232&H232&I232&J232=\"\",K232,IF(G232&H232&I232=\"\",J232,(IF(G232&H232=\"\",I232,IF(G232=\"\",H232,G232))))))","v":1},null,1,{"$nulls":5},"カルタンＯＤ錠５００ｍｇ"]
["カルデナリン錠１ｍｇ",null,null,"●",1,{"$f":"IF(G233&H233&I233&I233&J233&K233=\"\",\"\",IF(G233&H233&I233&J233=\"\",K233,IF(G233&H233&I233=\"\",J233,(IF(G233&H233=\"\",I233,IF(G233=\"\",H233,G233))))))","v":1},null,1,{"$nulls":5},"カルデナリン錠１ｍｇ"]
["カルナクリン錠５０　５０国際単位","三和化学",null,"▲",6,{"$f":"IF(G234&H234&I234&I234&J234&K234=\"\",\"\",IF(G234&H234&I234&J234=\"\",K234,IF(G234&H234&I234=\"\",J234,(IF(G234&H234=\"\",I234,IF(G234=\"\",H234,G234))))))","v":6},null,null,6,null,null,"腸溶性(胃で失活)　腸から投与であれば破壊後懸濁可　胃からの投与であれば主治医相談",null,"カルナクリン錠５０　５０国際単位","院内採用"]
["カルバゾクロムスルホン酸ナトリウム錠30mg「日医工」",{"$nulls":3},1,{"$nulls":3},1,{"$nulls":5},"院内採用"]
["カルブロック錠１６ｍｇ",null,null,"●",2,{"$f":"IF(G236&H236&I236&I236&J236&K236=\"\",\"\",IF(G236&H236&I236&J236=\"\",K236,IF(G236&H236&I236=\"\",J236,(IF(G236&H236=\"\",I236,IF(G236=\"\",H236,G236))))))","v":2},null,2,{"$nulls":5},"カルブロック錠１６ｍｇ"]
["カルベジロール錠10mg「サワイ」",{"$nulls":3},1,{"$nulls":3},1,{"$nulls":5},"院内採用"]
["カルベジロール錠2.5mg「サワイ」",{"$nulls":3},1,{"$nulls":3},1,{"$nulls":5},"院内採用"]
["カルボシステインDS50%「タカタ」",{"$nulls":3},1,{"$nulls":3},1,{"$nulls":5},"院内採用"]
["カルボシステイン錠250ｍｇ「テバ」","テバ",null,"●",1,{"$f":"IF(G240&H240&I240&I240&J240&K240=\"\",\"\",IF(G240&H240&I240&J240=\"\",K240,IF(G240&H240&I240=\"\",J240,(IF(G240&H240=\"\",I240,IF(G240=\"\",H240,G240))))))","v":1},null,1,{"$nulls":5},"カルボシステイン錠250ｍｇ「テバ」","院内採用"]
["カレトラ配合錠","アッヴィ合同",null,"×",6,6,null,6,{"$nulls":3},"データなし　HIV　カレトラ・リキッド（同成分）へ変更",null,"カレトラ配合錠","院内採用"]
["カロナール錠　２００ｍｇ",null,null,"●",1,1,null,1,{"$nulls":5},"カロナール錠　２００ｍｇ"]
["カンデサルタン錠８ｍｇ「あすか」","あすか",null,"●",1,1,null,null,1,{"$nulls":4},"カンデサルタン錠８ｍｇ「あすか」","院内採用"]
["キネダック錠　５０ｍｇ",null,null,"▲",1,1,null,1,{"$nulls":5},"キネダック錠　５０ｍｇ"]
["きゅう帰調血飲エキス顆粒","太虎精堂",null,null,1,1,null,null,1,{"$nulls":4},"きゅう帰調血飲エキス顆粒"]
["グーフィス錠5mg",{"$nulls":3},1,{"$nulls":3},1]
["クエチアピン錠25ｍｇ「ＤＳＥＰ」",null,null,"●",1,{"$f":"IF(G247&H247&I247&I247&J247&K247=\"\",\"\",IF(G247&H247&I247&J247=\"\",K247,IF(G247&H247&I247=\"\",J247,(IF(G247&H247=\"\",I247,IF(G247=\"\",H247,G247))))))","v":1},null,1,{"$nulls":5},"クエチアピン錠25ｍｇ「ＤＳＥＰ」","院内採用"]
["クエン酸第一鉄ナトリウム錠50mg「サワイ」",{"$nulls":3},2,{"$nulls":3},2,{"$nulls":5},"院内採用"]
["グッドミン錠０．２５ｍｇ",null,null,"●",1,{"$f":"IF(G249&H249&I249&I249&J249&K249=\"\",\"\",IF(G249&H249&I249&J249=\"\",K249,IF(G249&H249&I249=\"\",J249,(IF(G249&H249=\"\",I249,IF(G249=\"\",H249,G249))))))","v":1},null,1,{"$nulls":5},"グッドミン錠０．２５ｍｇ"]
["グラケ－カプセル１５ｍｇ　",null,null,"▲",1,{"$f":"IF(G250&H250&I250&I250&J250&K250=\"\",\"\",IF(G250&H250&I250&J250=\"\",K250,IF(G250&H250&I250=\"\",J250,(IF(G250&H250=\"\",I250,IF(G250=\"\",H250,G250))))))","v":1},null,1,{"$nulls":3},"油状物質付着で含量低下の可能性あり",null,"グラケ－カプセル１５ｍｇ　","院内採用"]
["ｸﾗｼｴ　十味敗毒湯ｴｷｽ細粒",{"$nulls":3},1,{"$nulls":3},1]
["クラシエ十全大補湯エキス細粒",{"$nulls":3},1,{"$f":"IF(G252&H252&I252&I252&J252&K252=\"\",\"\",IF(G252&H252&I252&J252=\"\",K252,IF(G252&H252&I252=\"\",J252,(IF(G252&H252=\"\",I252,IF(G252=\"\",H252,G252))))))","v":1},null,1,{"$nulls":5},"クラシエ十全大補湯エキス細粒","院内採用"]
["クラシエ当帰芍薬散料エキス細粒　２g","クラシエ",null,null,1,{"$f":"IF(G253&H253&I253&I253&J253&K253=\"\",\"\",IF(G253&H253&I253&J253=\"\",K253,IF(G253&H253&I253=\"\",J253,(IF(G253&H253=\"\",I253,IF(G253=\"\",H253,G253))))))","v":1},null,null,1,{"$nulls":4},"クラシエ当帰芍薬散料エキス細粒　２g","院内採用"]
["クラシエ半夏厚朴湯","クラシエ",null,null,1,{"$f":"IF(G254&H254&I254&I254&J254&K254=\"\",\"\",IF(G254&H254&I254&J254=\"\",K254,IF(G254&H254&I254=\"\",J254,(IF(G254&H254=\"\",I254,IF(G254=\"\",H254,G254))))))","v":1},null,null,1,{"$nulls":4},"クラシエ半夏厚朴湯","院内採用"]
["クラシエ芍薬甘草湯エキス細粒",{"$nulls":3},1,{"$f":"IF(G255&H255&I255&I255&J255&K255=\"\",\"\",IF(G255&H255&I255&J255=\"\",K255,IF(G255&H255&I255=\"\",J255,(IF(G255&H255=\"\",I255,IF(G255=\"\",H255,G255))))))","v":1},null,1,{"$nulls":5},"クラシエ芍薬甘草湯エキス細粒","院内採用"]
["グラジナ錠　50mg",{"$nulls":3},6,{"$nulls":3},6,null,null,"データなし　Drと要相談"]
["クラバモックス小児用配合ドライシロップ","グラクソ",null,null,6,{"$f":"IF(G257&H257&I257&I257&J257&K257=\"\",\"\",IF(G257&H257&I257&J257=\"\",K257,IF(G257&H257&I257=\"\",J257,(IF(G257&H257=\"\",I257,IF(G257=\"\",H257,G257))))))","v":6},6,{"$nulls":4},"水薬として払い出し　簡易懸濁対象外　高温で薬効低下するため溶解は常温の水を使用すること",null,"クラバモックス小児用配合ドライシロップ","院内採用"]
["グラマリール錠２５ｍｇ　",null,null,"▲",2,{"$f":"IF(G258&H258&I258&I258&J258&K258=\"\",\"\",IF(G258&H258&I258&J258=\"\",K258,IF(G258&H258&I258=\"\",J258,(IF(G258&H258=\"\",I258,IF(G258=\"\",H258,G258))))))","v":2},null,2,{"$nulls":5},"グラマリール錠２５ｍｇ　","院内採用"]
["クラリシッド錠２００ｍｇ","アボット",null,"▲",1,{"$f":"IF(G259&H259&I259&I259&J259&K259=\"\",\"\",IF(G259&H259&I259&J259=\"\",K259,IF(G259&H259&I259=\"\",J259,(IF(G259&H259=\"\",I259,IF(G259=\"\",H259,G259))))))","v":1},null,null,1,null,null,"クラリス同等",null,"クラリシッド錠２００ｍｇ"]
["クラリスドライシロップ10%小児用","大正富山",null,null,1,{"$f":"IF(G260&H260&I260&I260&J260&K260=\"\",\"\",IF(G260&H260&I260&J260=\"\",K260,IF(G260&H260&I260=\"\",J260,(IF(G260&H260=\"\",I260,IF(G260=\"\",H260,G260))))))","v":1},1,{"$nulls":4},"簡易懸濁データないが、クラリシッド錠は懸濁可","単独投与　常温の水で懸濁","クラリスドライシロップ10%小児用","院内採用"]
["クラリスロマイシン錠200mg「サワイ」",{"$nulls":3},1,{"$nulls":3},1,{"$nulls":5},"院内採用"]
["グランダキシン錠５０ｍｇ　",null,null,"▲",1,{"$f":"IF(G262&H262&I262&I262&J262&K262=\"\",\"\",IF(G262&H262&I262&J262=\"\",K262,IF(G262&H262&I262=\"\",J262,(IF(G262&H262=\"\",I262,IF(G262=\"\",H262,G262))))))","v":1},null,"1900-01-01",{"$nulls":3},"多めの水でフラッシュ",null,"グランダキシン錠５０ｍｇ　","院内採用"]
["グリクラジド錠40mg「サワイ」",null,null,"▲",1,1,null,null,1,{"$nulls":3},"血糖降下薬",null,"院内採用"]
["グリチロン配合錠",null,null,"●",2,2,null,2,{"$nulls":5},"グリチロン配合錠","院内採用"]
["グリベック錠１００ｍｇ",null,null,"×",4,1,null,1,{"$nulls":3},"抗がん剤","単独投与　投与器具は毎回破棄　曝露に注意","グリベック錠１００ｍｇ","院内採用"]
["グリミクロン錠　４０ｍｇ",null,null,"▲",1,1,null,1,{"$nulls":4},"血糖降下薬","グリミクロン錠　４０ｍｇ"]
["グルコバイ錠５０ｍｇ",null,null,"×",4,1,null,1,{"$nulls":4},"血糖降下薬","グルコバイ錠５０ｍｇ"]
["グルコンサンＫ細粒　４ｍEq/g",{"$nulls":3},1,1,null,1,{"$nulls":5},"グルコンサンＫ細粒　４ｍEq/g","院内採用"]
["グルファスト錠　１０ｍｇ","キッセイ",null,"▲",1,1,null,1,{"$nulls":4},"血糖降下薬","グルファスト錠　１０ｍｇ","院内採用"]
["グレースビット錠50mg",{"$nulls":3},1,{"$nulls":3},1]
["クレストールOD錠　２．５ｍｇ",{"$nulls":3},1,{"$nulls":3},1]
["クレストールOD錠５ｍｇ",{"$nulls":3},1,{"$nulls":3},1]
["クレストール錠２．５ｍｇ","アストラゼネカ",null,"●",1,{"$f":"IF(G273&H273&I273&I273&J273&K273=\"\",\"\",IF(G273&H273&I273&J273=\"\",K273,IF(G273&H273&I273=\"\",J273,(IF(G273&H273=\"\",I273,IF(G273=\"\",H273,G273))))))","v":1},{"$nulls":3},1,{"$nulls":3},"クレストール錠２．５ｍｇ"]
["クレメジンカプセル２００ｍｇ",null,null,"×",4,{"$f":"IF(G274&H274&I274&I274&J274&K274=\"\",\"\",IF(G274&H274&I274&J274=\"\",K274,IF(G274&H274&I274=\"\",J274,(IF(G274&H274=\"\",I274,IF(G274=\"\",H274,G274))))))","v":1},null,1,{"$nulls":3},"細粒に準ずる","単独投与　他剤服用後30分～1時間は間隔をあけるほうが良い","クレメジンカプセル２００ｍｇ"]
["クレメジン速崩錠500mg",{"$nulls":3},6,{"$nulls":3},6,{"$nulls":3},"単独投与　他剤服用後30分～1時間は間隔をあけるほうが良い",null,"院内採用"]
["クレメジン細粒分包２g",{"$nulls":3},1,{"$f":"IF(G276&H276&I276&I276&J276&K276=\"\",\"\",IF(G276&H276&I276&J276=\"\",K276,IF(G276&H276&I276=\"\",J276,(IF(G276&H276=\"\",I276,IF(G276=\"\",H276,G276))))))","v":1},null,1,{"$nulls":3},"溶けないため振り混ぜながら注入　メーカーとしては他剤服用後30分～1時間は間隔をあけてから投与することを推奨。クレメジンを先に内服した場合はデータがないためなるべく長く間隔を空けるようにとのこと。","単独投与　他剤服用後30分～1時間は間隔をあけるほうが良い","クレメジン細粒分包２g"]
["クロピドグレル錠25mg「SANIC」",null,null,"▲",2,{"$f":"IF(G277&H277&I277&I277&J277&K277=\"\",\"\",IF(G277&H277&I277&J277=\"\",K277,IF(G277&H277&I277=\"\",J277,(IF(G277&H277=\"\",I277,IF(G277=\"\",H277,G277))))))","v":2},null,2,{"$nulls":3},"オーソライズドジェネリックのため先発と同一",null,null,"院内採用"]
["クロピドグレル錠75mg「SANIC」",null,null,"●",2,{"$f":"IF(G278&H278&I278&I278&J278&K278=\"\",\"\",IF(G278&H278&I278&J278=\"\",K278,IF(G278&H278&I278=\"\",J278,(IF(G278&H278=\"\",I278,IF(G278=\"\",H278,G278))))))","v":2},null,2,{"$nulls":3},"オーソライズドジェネリックのため先発と同一",null,null,"院内採用"]
["ケアラム錠25mg",{"$nulls":3},1,{"$nulls":3},1,{"$nulls":5},"院内採用"]
["ケイキサレート散　５g",{"$nulls":3},1,{"$f":"IF(G280&H280&I280&I280&J280&K280=\"\",\"\",IF(G280&H280&I280&J280=\"\",K280,IF(G280&H280&I280=\"\",J280,(IF(G280&H280=\"\",I280,IF(G280=\"\",H280,G280))))))","v":1},1,6,{"$nulls":3},"2.5gあたり水20mLで懸濁し直後に注入（10分放置しない)","2.5gあたり水20mLで懸濁しすぐに注入","ケイキサレート散　５g"]
["ケーサプライ錠600ｍｇ","アルフレッサ","佐藤薬品","●",6,{"$f":"IF(G281&H281&I281&I281&J281&K281=\"\",\"\",IF(G281&H281&I281&J281=\"\",K281,IF(G281&H281&I281=\"\",J281,(IF(G281&H281=\"\",I281,IF(G281=\"\",H281,G281))))))","v":6},6,{"$nulls":4},"徐放　K.C.L.エリキシル（同成分）・グルコン酸K細粒（同効）へ変更",null,"ケーサプライ錠600ｍｇ","院内採用"]
["ケタスカプセル１０ｍｇ","杏林",null,"▲",6,{"$f":"IF(G282&H282&I282&I282&J282&K282=\"\",\"\",IF(G282&H282&I282&J282=\"\",K282,IF(G282&H282&I282=\"\",J282,(IF(G282&H282=\"\",I282,IF(G282=\"\",H282,G282))))))","v":6},null,6,6,null,null,"12Fr.なら通過　11Fr.以下の細いチューブの場合は主治医と相談",null,"ケタスカプセル１０ｍｇ","院内採用"]
["ゲフィチニブ錠250mg「DSEP」",{"$nulls":3},4,null,null,1,{"$nulls":3},"抗がん剤 オーソライズドジェネリックのため先発と同一","単独投与　投与器具は毎回破棄　曝露に注意",null,"院内採用"]
["ケフラールカプセル２５０ｍｇ",null,null,"▲",1,{"$f":"IF(G284&H284&I284&I284&J284&K284=\"\",\"\",IF(G284&H284&I284&J284=\"\",K284,IF(G284&H284&I284=\"\",J284,(IF(G284&H284=\"\",I284,IF(G284=\"\",H284,G284))))))","v":1},null,1,{"$nulls":5},"ケフラールカプセル２５０ｍｇ"]
["ケフラール細粒小児用１００ｍｇ",{"$nulls":3},1,{"$f":"IF(G285&H285&I285&I285&J285&K285=\"\",\"\",IF(G285&H285&I285&J285=\"\",K285,IF(G285&H285&I285=\"\",J285,(IF(G285&H285=\"\",I285,IF(G285=\"\",H285,G285))))))","v":1},null,1,{"$nulls":5},"ケフラール細粒小児用１００ｍｇ","院内採用"]
["ゲンボイヤ配合錠",{"$nulls":3},1,{"$nulls":3},1,null,null,"HIV",null,null,"院内採用"]
["コスパノン錠40mg",{"$nulls":3},1,{"$nulls":3},1,{"$nulls":5},"院内採用"]
["コデインリン酸塩「タケダ」　１％","武田",null,null,1,{"$f":"IF(G288&H288&I288&I288&J288&K288=\"\",\"\",IF(G288&H288&I288&J288=\"\",K288,IF(G288&H288&I288=\"\",J288,(IF(G288&H288=\"\",I288,IF(G288=\"\",H288,G288))))))","v":1},{"$nulls":3},1,null,"「タケダ」のデータはないが他施設DBでほぼ可となっている",null,"コデインリン酸塩「タケダ」　１％","院内採用"]
["コ－トリル錠　１０ｍｇ",null,null,"▲",1,{"$f":"IF(G289&H289&I289&I289&J289&K289=\"\",\"\",IF(G289&H289&I289&J289=\"\",K289,IF(G289&H289&I289=\"\",J289,(IF(G289&H289=\"\",I289,IF(G289=\"\",H289,G289))))))","v":1},null,1,{"$nulls":5},"コ－トリル錠　１０ｍｇ","院内採用"]
["コニール錠４",null,null,"●",1,{"$f":"IF(G290&H290&I290&I290&J290&K290=\"\",\"\",IF(G290&H290&I290&J290=\"\",K290,IF(G290&H290&I290=\"\",J290,(IF(G290&H290=\"\",I290,IF(G290=\"\",H290,G290))))))","v":1},null,1,{"$nulls":5},"コニール錠４"]
["コペガス錠２００ｍｇ","中外",null,"▲",6,{"$f":"IF(G291&H291&I291&I291&J291&K291=\"\",\"\",IF(G291&H291&I291&J291=\"\",K291,IF(G291&H291&I291=\"\",J291,(IF(G291&H291=\"\",I291,IF(G291=\"\",H291,G291))))))","v":6},null,null,6,null,null,"55℃20mL30分放置で懸濁可　錠剤粉砕可",null,"コペガス錠２００ｍｇ"]
["コムタン錠１００ｍｇ","ノバルティス",null,"▲",1,{"$f":"IF(G292&H292&I292&I292&J292&K292=\"\",\"\",IF(G292&H292&I292&J292=\"\",K292,IF(G292&H292&I292=\"\",J292,(IF(G292&H292=\"\",I292,IF(G292=\"\",H292,G292))))))","v":1},null,1,{"$nulls":3},"チューブが着色する場合あり（他院データ）",null,"コムタン錠１００ｍｇ","院内採用"]
["コララン錠2.5mg",{"$nulls":3},1,{"$nulls":3},1,{"$nulls":5},"院内採用"]
["コランチル配合顆粒　１g",{"$nulls":3},1,{"$f":"IF(G294&H294&I294&I294&J294&K294=\"\",\"\",IF(G294&H294&I294&J294=\"\",K294,IF(G294&H294&I294=\"\",J294,(IF(G294&H294=\"\",I294,IF(G294=\"\",H294,G294))))))","v":1},null,1,{"$nulls":3},"多めの水でフラッシュ",null,"コランチル配合顆粒　１g"]
["コルヒチン錠「タカタ」　０．５ｍｇ","高田製薬",null,"▲",1,1,null,1,{"$nulls":5},"コルヒチン錠「タカタ」　０．５ｍｇ","院内採用"]
["コレアジン錠12.5ｍｇ","アルフレッサ",null,"▲",1,1,null,null,1,{"$nulls":4},"コレアジン錠12.5ｍｇ","院内採用"]
["コレバインミニ８３％　１．８１g",{"$nulls":3},6,6,null,6,{"$nulls":3},"経管投与不可　他の高脂血症薬へ変更",null,"コレバインミニ８３％　１．８１g","院内採用"]
["コロネル錠　５００ｍｇ",null,null,"▲",6,6,null,6,{"$nulls":3},"データなし　錠剤粉砕可",null,"コロネル錠　５００ｍｇ","院内採用"]
["コントール散１％","武田",null,null,1,1,1,{"$nulls":4},"簡易懸濁データなし","単独投与　常温の水で懸濁","コントール散１％","院内採用"]
["コントミン糖衣錠　１２．５ｍｇ",null,null,"▲",2,2,null,2,{"$nulls":5},"コントミン糖衣錠　１２．５ｍｇ","院内採用"]
["ザーコリカプセル200mg",{"$nulls":3},6,{"$nulls":3},6,null,null,"データなし　抗がん剤　代替薬ないため主治医と相談",null,null,"院内採用"]
["ザーコリカプセル250mg",{"$nulls":3},6,{"$nulls":3},6,null,null,"データなし　抗がん剤　代替薬ないため主治医と相談",null,null,"院内採用"]
["サアミオン錠　５ｍｇ",null,null,"▲",2,{"$f":"IF(G303&H303&I303&I303&J303&K303=\"\",\"\",IF(G303&H303&I303&J303=\"\",K303,IF(G303&H303&I303=\"\",J303,(IF(G303&H303=\"\",I303,IF(G303=\"\",H303,G303))))))","v":2},null,2,{"$nulls":5},"サアミオン錠　５ｍｇ"]
["ザイアジェン錠３００ｍｇ","ヴィーブ",null,"×",4,1,null,1,{"$nulls":3},"HIV",null,"ザイアジェン錠３００ｍｇ","院内採用"]
["ザイザル錠５ｍｇ","グラクソ",null,"●",1,1,null,1,1,{"$nulls":4},"ザイザル錠５ｍｇ"]
["ザイティガ錠250ｍｇ","ヤンセン",null,"×",6,6,{"$nulls":3},6,null,"データなし　抗がん剤　代用薬ないため主治医判断","単独投与　投与器具は毎回破棄　曝露に注意","ザイティガ錠250ｍｇ"]
["サイトテック錠２００",null,null,"▲",1,1,null,1,{"$nulls":5},"サイトテック錠２００","院内採用"]
["ザイボックス錠６００ｍｇ","ファイザー",null,"×",4,1,null,1,{"$nulls":5},"ザイボックス錠６００ｍｇ"]
["サイレース錠１ｍｇ　",null,null,"▲",1,1,null,1,{"$nulls":5},"サイレース錠１ｍｇ　"]
["サインバルタカプセル２０ｍｇ","リリー","塩野義","▲",6,6,null,6,{"$nulls":3},"腸溶性（原薬が胃で失活しないようカプセル内の顆粒腸溶コーティング)　トレドミン（同効・SNRI)・他の抗うつ剤へ変更　　脱カプセルして中の粒をつぶさず溶かさなければ内服可能",null,"サインバルタカプセル２０ｍｇ","院内採用"]
["ザジテンＤＳ　０．１％","ノバルティスファーマ",null,null,1,1,{"$nulls":3},1,null,"表面に白いものが残る",null,"ザジテンＤＳ　０．１％"]
["サムスカOD錠15mg",{"$nulls":3},1,null,null,1,{"$nulls":3},"サムスカ錠15mgに準ずる",null,null,"院内採用"]
["サムスカOD錠7.5mg",{"$nulls":3},1,null,null,1,{"$nulls":3},"サムスカ錠7.5mgに準ずる",null,null,"院内採用"]
["サムスカ錠215ｍｇ","大塚",null,"▲",1,{"$f":"IF(G314&H314&I314&I314&J314&K314=\"\",\"\",IF(G314&H314&I314&J314=\"\",K314,IF(G314&H314&I314=\"\",J314,(IF(G314&H314=\"\",I314,IF(G314=\"\",H314,G314))))))","v":1},null,null,1,null,null,"口渇を感じない患者は禁忌（経管投与している状態の患者は意識状態の低下がみられることも多いため注意）",null,"サムスカ錠7.5ｍｇ"]
["サムスカ錠7.5ｍｇ","大塚",null,"▲",1,1,null,null,1,null,null,"口渇を感じない患者は禁忌（経管投与している状態の患者は意識状態の低下がみられることも多いため注意）",null,"サムスカ錠１５ｍｇ"]
["サラゾピリン錠　５００ｍｇ",null,null,"▲",1,1,null,1,{"$nulls":5},"サラゾピリン錠　５００ｍｇ"]
["ザルティア錠5ｍｇ","リリー",null,"▲",1,1,null,null,1,{"$nulls":4},"ザルティア錠5ｍｇ","院内採用"]
["サレドカプセル１００ｍｇ","藤本製薬",null,"×",4,1,null,1,{"$nulls":3},"抗がん剤","単独投与　投与器具は毎回破棄　曝露に注意","サレドカプセル１００ｍｇ","院内採用"]
["サレドカプセル５０ｍｇ","藤本製薬",null,"×",4,1,null,1,{"$nulls":3},"抗がん剤","単独投与　投与器具は毎回破棄　曝露に注意","サレドカプセル５０ｍｇ","院内採用"]
["サワシリン細粒　１００ｍｇ",{"$nulls":3},1,1,null,1,{"$nulls":5},"サワシリン細粒　１００ｍｇ","院内採用"]
["酸化マグネシウム（重質）","日本新薬","シオエ",null,1,1,{"$nulls":3},1,null,"詰まりやすい　酸化マグネシウム錠へ変更推奨",null,"酸化マグネシウム「シオエ」","院内採用"]
["酸化マグネシウム錠２５０ｍｇ　",null,null,"×",4,1,null,1,{"$nulls":5},"マグラックス錠２５０ｍｇ　","院内採用"]
["ザンタック錠　１５０",null,null,"×",3,2,null,2,{"$nulls":3},"直前にコーティング破壊　光による着色・吸湿性あり","◆投与直前にコーティングに亀裂を入れる◆　","ザンタック錠　１５０"]
["サンリズムカプセル２５ｍｇ",null,null,"●",1,1,null,1,{"$nulls":3},"局所麻酔作用あり、舌のしびれ・食道膨脹のおそれあり",null,"サンリズムカプセル２５ｍｇ","院内採用"]
["ジアゼパム錠2mg「アメル」",{"$nulls":3},1,{"$nulls":3},1,{"$nulls":5},"院内採用"]
["ジアゾキシドカプセル25ｍｇ「ＭＳＤ」","MSD",null,"▲",6,{"$f":"IF(G326&H326&I326&I326&J326&K326=\"\",\"\",IF(G326&H326&I326&J326=\"\",K326,IF(G326&H326&I326=\"\",J326,(IF(G326&H326=\"\",I326,IF(G326=\"\",H326,G326))))))","v":6},{"$nulls":3},6,null,"データなし　脱カプセル可能",null,"ジアゾキシドカプセル25ｍｇ「ＭＳＤ」"]
["シーエルセントリ錠125ｍｇ","ヴィーブ",null,"×",4,1,null,1,{"$nulls":3},"HIV",null,"シーエルセントリ錠125ｍｇ","院内採用"]
["ジェイゾロフト錠２５ｍｇ","ファイザー",null,"▲",6,6,null,null,6,null,null,"シリンジ内付着　錠剤粉砕可",null,"ジェイゾロフト錠２５ｍｇ","院内採用"]
["ジェニナック錠２００ｍｇ","大正富山",null,"▲",1,1,null,null,1,{"$nulls":4},"ジェニナック錠２００ｍｇ","院内採用"]
["ジオトリフ錠20ｍｇ","ベーリンガー",null,"×",6,6,6,{"$nulls":4},"抗がん剤/懸濁液の安定性（55℃10ｍｌ10分）はあるがチューブ通過は確認なし/必要時相談　代用薬ないため主治医判断","単独投与　投与器具は毎回破棄　曝露に注意","ジオトリフ錠20ｍｇ","院内採用"]
["ジオトリフ錠30ｍｇ","ベーリンガー",null,"×",6,6,6,{"$nulls":4},"抗がん剤/懸濁液の安定性（55℃10ｍｌ10分）はあるがチューブ通過は確認なし/必要時相談　代用薬ないため主治医判断","単独投与　投与器具は毎回破棄　曝露に注意","ジオトリフ錠30ｍｇ","院内採用"]
["ジオトリフ錠40ｍｇ","ベーリンガー",null,"×",6,6,6,{"$nulls":4},"抗がん剤/懸濁液の安定性（55℃10ｍｌ10分）はあるがチューブ通過は確認なし/必要時相談　代用薬ないため主治医判断","単独投与　投与器具は毎回破棄　曝露に注意","ジオトリフ錠40ｍｇ","院内採用"]
["ジオトリフ錠50ｍｇ","ベーリンガー",null,"×",6,6,6,{"$nulls":4},"抗がん剤/懸濁液の安定性（55℃10ｍｌ10分）はあるがチューブ通過は確認なし/必要時相談　代用薬ないため主治医判断","単独投与　投与器具は毎回破棄　曝露に注意","ジオトリフ錠50ｍｇ","院内採用"]
["ジカディアカプセル150mg",{"$nulls":3},4,{"$nulls":3},4,null,null,"抗がん剤　データなし　大阪府下の他施設で行っている","単独投与　投与器具は毎回破棄　曝露に注意"]
["シクレスト舌下錠5mg",{"$nulls":3},6,{"$nulls":3},6,null,null,"舌下錠のため不可　同効薬のMARTA（オランザピン・クエチアピン）へ変更可　ただし、DM患者へは禁忌（シクレスト舌下錠はDM患者へ投与可）",null,null,"院内採用"]
["ジクロフェナクＮａ錠　25mg「ﾄｰﾜ」",{"$nulls":3},1,null,null,1,{"$nulls":6},"院内採用"]
["ジクロフェナクＮａ徐放ｶﾌﾟｾﾙ37.5mg「ﾄｰﾜ」",{"$nulls":3},6,null,null,6,{"$nulls":3},"データなし",null,null,"院内採用"]
["ジゴシン１０００倍散　０．１％","中外",null,null,1,{"$f":"IF(G338&H338&I338&I338&J338&K338=\"\",\"\",IF(G338&H338&I338&J338=\"\",K338,IF(G338&H338&I338=\"\",J338,(IF(G338&H338=\"\",I338,IF(G338=\"\",H338,G338))))))","v":1},{"$nulls":3},1,{"$nulls":3},"ジゴシン１０００倍散　０．１％"]
["ジスロマックカプセル小児用１００ｍｇ","ファイザー",null,"▲",6,{"$f":"IF(G339&H339&I339&I339&J339&K339=\"\",\"\",IF(G339&H339&I339&J339=\"\",K339,IF(G339&H339&I339=\"\",J339,(IF(G339&H339=\"\",I339,IF(G339=\"\",H339,G339))))))","v":6},6,{"$nulls":4},"データなし　ジスロマック細粒小児用10%（同成分）へ変更",null,"ジスロマックカプセル小児用１００ｍｇ"]
["ジスロマック錠600mg",{"$nulls":3},4,{"$nulls":3},4,{"$nulls":5},"院内採用"]
["ジスロマック細粒　小児用",{"$nulls":3},1,{"$f":"IF(G341&H341&I341&I341&J341&K341=\"\",\"\",IF(G341&H341&I341&J341=\"\",K341,IF(G341&H341&I341=\"\",J341,(IF(G341&H341=\"\",I341,IF(G341=\"\",H341,G341))))))","v":1},null,1,{"$nulls":5},"ジスロマック細粒　小児用"]
["ジスロマック錠２５０ｍｇ　",null,null,"×",4,{"$f":"IF(G342&H342&I342&I342&J342&K342=\"\",\"\",IF(G342&H342&I342&J342=\"\",K342,IF(G342&H342&I342=\"\",J342,(IF(G342&H342=\"\",I342,IF(G342=\"\",H342,G342))))))","v":1},null,1,{"$nulls":5},"ジスロマック錠２５０ｍｇ　"]
["シダキュアスギ花粉舌下錠2000JAU",{"$nulls":3},6,{"$nulls":3},6,null,null,"特殊　簡易懸濁対象外",null,null,"院内採用"]
["シダキュアスギ花粉舌下錠5000JAU",{"$nulls":3},6,{"$nulls":3},6,null,null,"特殊　簡易懸濁対象外"]
["シタフロキサシン錠50mg「サワイ」",{"$nulls":3},1,{"$nulls":3},1,{"$nulls":5},"院内採用"]
["シナール配合顆粒　１g",{"$nulls":3},1,{"$f":"IF(G346&H346&I346&I346&J346&K346=\"\",\"\",IF(G346&H346&I346&J346=\"\",K346,IF(G346&H346&I346=\"\",J346,(IF(G346&H346=\"\",I346,IF(G346=\"\",H346,G346))))))","v":1},null,1,{"$nulls":5},"シナール配合顆粒　１g"]
["ジプレキサ錠２．５ｍｇ","リリー",null,"▲",1,{"$f":"IF(G347&H347&I347&I347&J347&K347=\"\",\"\",IF(G347&H347&I347&J347=\"\",K347,IF(G347&H347&I347=\"\",J347,(IF(G347&H347=\"\",I347,IF(G347=\"\",H347,G347))))))","v":1},{"$nulls":3},1,{"$nulls":3},"ジプレキサ錠２．５ｍｇ"]
["シプロキサン錠１００ｍｇ",null,null,"▲",1,{"$f":"IF(G348&H348&I348&I348&J348&K348=\"\",\"\",IF(G348&H348&I348&J348=\"\",K348,IF(G348&H348&I348=\"\",J348,(IF(G348&H348=\"\",I348,IF(G348=\"\",H348,G348))))))","v":1},null,1,{"$nulls":5},"シプロキサン錠１００ｍｇ"]
["シプロフロキサシン錠100mg「日医工」",{"$nulls":3},1,null,null,1,6,null,null,"ハンドブックの情報を適応",null,null,"院内採用"]
["シベクトロ錠200mg",{"$nulls":3},6,{"$nulls":3},6,null,null,"データなし　錠剤粉砕不可　代替薬は主治医と相談",null,null,"院内採用"]
["シベノール錠５０ｍｇ　",null,null,"▲",1,{"$f":"IF(G351&H351&I351&I351&J351&K351=\"\",\"\",IF(G351&H351&I351&J351=\"\",K351,IF(G351&H351&I351=\"\",J351,(IF(G351&H351=\"\",I351,IF(G351=\"\",H351,G351))))))","v":1},null,1,{"$nulls":5},"シベノール錠５０ｍｇ　","院内採用"]
["シムツーザ配合錠",{"$nulls":3},6,{"$nulls":3},6,null,null,"HIV治療薬",null,null,"院内採用"]
["ジメチコン錠40mg「フソー」",{"$nulls":3},1,{"$nulls":3},1,{"$nulls":5},"院内採用"]
["ジャカビ錠5ｍｇ","ノバルティス",null,"×",6,{"$f":"IF(G354&H354&I354&I354&J354&K354=\"\",\"\",IF(G354&H354&I354&J354=\"\",K354,IF(G354&H354&I354=\"\",J354,(IF(G354&H354=\"\",I354,IF(G354=\"\",H354,G354))))))","v":6},6,{"$nulls":4},"データなし　抗がん剤/必要時相談　代用薬ないため主治医判断","単独投与　投与器具は毎回破棄　曝露に注意","ジャカビ錠5ｍｇ","院内採用"]
["ジャディアンス錠10mg",{"$nulls":3},6,{"$nulls":3},6,null,null,"データなし同効薬のカナグル錠へ変更依頼"]
["ｼﾞｬﾄﾞﾆｭ顆粒分包90mg",{"$nulls":3},6,{"$nulls":3},6,null,null,"ﾃﾞｰﾀなし　代用薬ないため主治医判断"]
["ｼﾞｬﾄﾞﾆｭ顆粒分包360mg",{"$nulls":3},6,{"$nulls":3},6,null,null,"ﾃﾞｰﾀなし　代用薬ないため主治医判断",null,null,"院内採用"]
["ジャヌビア錠　５０ｍｇ",null,null,"●",1,{"$f":"IF(G358&H358&I358&I358&J358&K358=\"\",\"\",IF(G358&H358&I358&J358=\"\",K358,IF(G358&H358&I358=\"\",J358,(IF(G358&H358=\"\",I358,IF(G358=\"\",H358,G358))))))","v":1},null,null,1,null,1,null,"血糖降下薬","ジャヌビア錠　５０ｍｇ","院内採用"]
["シュアポスト錠0.5mg",{"$nulls":3},1,{"$nulls":3},1,null,null,"懸濁後、安定性のデータがないため推奨はされていない","血糖降下薬",null,"院内採用"]
["重曹錠500mg「マイラン」",{"$nulls":3},1,{"$nulls":3},1]
["ジュリナ錠0，5mg",{"$nulls":3},6,{"$nulls":3},6,null,null,"データなし　代用薬ないため主治医判断"]
["ジルチアゼム塩酸塩Rカプセル100mg",{"$nulls":3},6,{"$nulls":3},6,null,null,"脱カプセルして中の粒をつぶさず溶かさなければ投与可能　スパンスル型で速効性の粒と徐放性の粒がカプセル内に含まれている 同成分ないため主治医判断",null,null,"院内採用"]
["ジルテックドライシロップ1.25%","U2Bジャパン",null,null,1,{"$f":"IF(G363&H363&I363&I363&J363&K363=\"\",\"\",IF(G363&H363&I363&J363=\"\",K363,IF(G363&H363&I363=\"\",J363,(IF(G363&H363=\"\",I363,IF(G363=\"\",H363,G363))))))","v":1},1,{"$nulls":4},"ジルテック錠は懸濁可/簡易懸濁データなし","単独投与　常温の水で懸濁","ジルテックドライシロップ1.25%"]
["ジルテック錠１０","U2ジャパン",null,"●",1,{"$f":"IF(G364&H364&I364&I364&J364&K364=\"\",\"\",IF(G364&H364&I364&J364=\"\",K364,IF(G364&H364&I364=\"\",J364,(IF(G364&H364=\"\",I364,IF(G364=\"\",H364,G364))))))","v":1},null,1,{"$nulls":5},"ジルテック錠１０"]
["シルニジピン錠10mg「サワイ」",{"$nulls":3},1,{"$nulls":3},1,{"$nulls":5},"院内採用"]
["シロスタゾールOD錠100mg「トーワ」",{"$nulls":3},1,{"$nulls":3},1,{"$nulls":5},"院内採用"]
["シロドシンOD錠4mg「DSEP」",{"$nulls":3},1,{"$nulls":3},1,{"$nulls":5},"院内採用"]
["シングレアチュアブル錠５","MSD",null,"×",6,{"$f":"IF(G368&H368&I368&I368&J368&K368=\"\",\"\",IF(G368&H368&I368&J368=\"\",K368,IF(G368&H368&I368=\"\",J368,(IF(G368&H368=\"\",I368,IF(G368=\"\",H368,G368))))))","v":6},null,null,6,null,null,"キプレスと同等として不適　水に溶けない　オノンドライシロップ（同効）へ変更",null,"シングレアチュアブル錠５"]
["シングレア細粒４ｍｇ","MSD",null,null,6,6,null,6,{"$nulls":3},"キプレス錠不可のため細粒も不可と考えられる　水に溶けない　オノンドライシロップ（同効）へ変更",null,"シングレア細粒４ｍｇ"]
["シングレア錠１０　１０ｍｇ","MSD",null,"▲",6,6,null,null,6,null,null,"キプレスと同等として不適　水に溶けない　オノンドライシロップ（同効）へ変更　プランルカスト錠（同効）へ変更",null,"シングレア錠１０　１０ｍｇ"]
["シンセロン錠８ｍｇ","杏林",null,"×",4,1,{"$nulls":3},1,{"$nulls":3},"シンセロン錠８ｍｇ"]
["シンメトレル細粒１０％",{"$nulls":3},1,1,null,1,{"$nulls":5},"シンメトレル細粒１０％","院内採用"]
["シンメトレル錠５０ｍｇ",null,null,"▲",1,1,null,1,{"$nulls":5},"シンメトレル錠５０ｍｇ","院内採用"]
["スインプロイク錠0.2mg",{"$nulls":3},6,{"$nulls":3},6,null,null,"データなし　代用薬ないため主治医判断",null,null,"院内採用"]
["スーグラ錠50mg",{"$nulls":3},1,{"$nulls":3},1,{"$nulls":3},"血糖降下薬",null,"院内採用"]
["スージャヌ配合錠",{"$nulls":3},6,{"$nulls":3},6,null,null,"データなし　カナグル（同効）＋ジャヌビア（同効）へ変更","血糖降下薬"]
["スーテントカプセル１２．５ｍｇ","ファイザー",null,"×",4,{"$f":"IF(G377&H377&I377&I377&J377&K377=\"\",\"\",IF(G377&H377&I377&J377=\"\",K377,IF(G377&H377&I377=\"\",J377,(IF(G377&H377=\"\",I377,IF(G377=\"\",H377,G377))))))","v":1},null,1,{"$nulls":3},"抗がん剤","単独投与　投与器具は毎回破棄　曝露に注意","スーテントカプセル１２．５ｍｇ","院内採用"]
["スクラルファート顆粒90%",{"$nulls":3},1,{"$nulls":3},1]
["スタラシドカプセル５０ｍｇ","日本化薬",null,"×",4,{"$f":"IF(G379&H379&I379&I379&J379&K379=\"\",\"\",IF(G379&H379&I379&J379=\"\",K379,IF(G379&H379&I379=\"\",J379,(IF(G379&H379=\"\",I379,IF(G379=\"\",H379,G379))))))","v":1},null,1,{"$nulls":3},"抗がん剤","単独投与　投与器具は毎回破棄　曝露に注意","スタラシドカプセル５０ｍｇ","院内採用"]
["スタリビルド配合錠","日本たばこ産業",null,"×",3,{"$f":"IF(G380&H380&I380&I380&J380&K380=\"\",\"\",IF(G380&H380&I380&J380=\"\",K380,IF(G380&H380&I380=\"\",J380,(IF(G380&H380=\"\",I380,IF(G380=\"\",H380,G380))))))","v":1},null,null,1,null,null,"HIV　お薬・虎の巻第7版より",null,"スタリビルド配合錠"]
["スチバーガ錠40ｍｇ","バイエル",null,"×",6,{"$f":"IF(G381&H381&I381&I381&J381&K381=\"\",\"\",IF(G381&H381&I381&J381=\"\",K381,IF(G381&H381&I381=\"\",J381,(IF(G381&H381=\"\",I381,IF(G381=\"\",H381,G381))))))","v":6},{"$nulls":3},6,null,"データなし　抗がん剤　代用薬ないため主治医判断","単独投与　投与器具は毎回破棄　曝露に注意","スチバーガ錠40ｍｇ"]
["ストックリン錠２００ｍｇ","MSD",null,"×",6,{"$f":"IF(G382&H382&I382&I382&J382&K382=\"\",\"\",IF(G382&H382&I382&J382=\"\",K382,IF(G382&H382&I382=\"\",J382,(IF(G382&H382=\"\",I382,IF(G382=\"\",H382,G382))))))","v":6},null,6,{"$nulls":3},"HIV　600mｇ参照　HIV担当者に相談","投与方法は要相談","ストックリン錠２００ｍｇ"]
["ストックリン錠６００ｍｇ","MSD",null,"×",6,{"$f":"IF(G383&H383&I383&I383&J383&K383=\"\",\"\",IF(G383&H383&I383&J383=\"\",K383,IF(G383&H383&I383=\"\",J383,(IF(G383&H383=\"\",I383,IF(G383=\"\",H383,G383))))))","v":6},null,6,{"$nulls":3},"データなし　HIV　HIV担当者に相談","投与方法は要相談","ストックリン錠６００ｍｇ","院内採用"]
["ストラテラカプセル40mg",{"$nulls":3},6,{"$nulls":3},6,null,null,"データなし　 内用液に変更"]
["ストロメクトール錠　３ｍｇ","マルホ","MSD","▲",1,{"$f":"IF(G385&H385&I385&I385&J385&K385=\"\",\"\",IF(G385&H385&I385&J385=\"\",K385,IF(G385&H385&I385=\"\",J385,(IF(G385&H385=\"\",I385,IF(G385=\"\",H385,G385))))))","v":1},null,1,{"$nulls":5},"ストロメクトール錠　３ｍｇ","院内採用"]
["スピロノラクトン錠25mg「日医工」",null,null,"●",1,{"$f":"IF(G386&H386&I386&I386&J386&K386=\"\",\"\",IF(G386&H386&I386&J386=\"\",K386,IF(G386&H386&I386=\"\",J386,(IF(G386&H386=\"\",I386,IF(G386=\"\",H386,G386))))))","v":1},null,null,1,{"$nulls":5},"院内採用"]
["ズファジラン錠10ｍｇ","第一三共",null,"▲",1,{"$f":"IF(G387&H387&I387&I387&J387&K387=\"\",\"\",IF(G387&H387&I387&J387=\"\",K387,IF(G387&H387&I387=\"\",J387,(IF(G387&H387=\"\",I387,IF(G387=\"\",H387,G387))))))","v":1},null,1,{"$nulls":5},"ズファジラン錠10ｍｇ"]
["スプリセル錠２０ｍｇ","ブリストルマイヤーズ",null,"×",4,{"$f":"IF(G388&H388&I388&I388&J388&K388=\"\",\"\",IF(G388&H388&I388&J388=\"\",K388,IF(G388&H388&I388=\"\",J388,(IF(G388&H388=\"\",I388,IF(G388=\"\",H388,G388))))))","v":1},null,1,{"$nulls":3},"抗がん剤　","単独投与　投与器具は毎回破棄　曝露に注意","スプリセル錠２０ｍｇ","院内採用"]
["スプリセル錠５０ｍｇ","ブリストルマイヤーズ",null,"×",4,{"$f":"IF(G389&H389&I389&I389&J389&K389=\"\",\"\",IF(G389&H389&I389&J389=\"\",K389,IF(G389&H389&I389=\"\",J389,(IF(G389&H389=\"\",I389,IF(G389=\"\",H389,G389))))))","v":1},null,1,{"$nulls":3},"抗がん剤","単独投与　投与器具は毎回破棄　曝露に注意","スプリセル錠５０ｍｇ","院内採用"]
["スマトリプタン50mg「アスペン」  ",{"$nulls":3},1,{"$nulls":3},1,null,null,"データないが、メーカーより先発のイミグランを参考と回答あり、イミグランと同様に簡易懸濁可とした",null,null,"院内採用"]
["スルピリドカプセル50mg「トーワ」",{"$nulls":3},1,{"$nulls":3},1]
["スルピリド錠50mg「サワイ」",{"$nulls":3},1,{"$nulls":3},1,{"$nulls":5},"院内採用"]
["スンベプラカプセル100ｍｇ","ブリストルマイヤーズ",null,"×",6,{"$f":"IF(G393&H393&I393&I393&J393&K393=\"\",\"\",IF(G393&H393&I393&J393=\"\",K393,IF(G393&H393&I393=\"\",J393,(IF(G393&H393=\"\",I393,IF(G393=\"\",H393,G393))))))","v":6},{"$nulls":3},6,null,"油の液体軟カプセルのため不可　代用薬ないため主治医判断",null,"スンベプラカプセル100ｍｇ"]
["セイブル錠　５０ｍｇ","三和化学",null,"▲",2,{"$f":"IF(G394&H394&I394&I394&J394&K394=\"\",\"\",IF(G394&H394&I394&J394=\"\",K394,IF(G394&H394&I394=\"\",J394,(IF(G394&H394=\"\",I394,IF(G394=\"\",H394,G394))))))","v":2},null,null,2,{"$nulls":4},"セイブル錠　５０ｍｇ"]
["ゼチーア錠１０ｍｇ","MSD",null,"●",1,{"$f":"IF(G395&H395&I395&I395&J395&K395=\"\",\"\",IF(G395&H395&I395&J395=\"\",K395,IF(G395&H395&I395=\"\",J395,(IF(G395&H395=\"\",I395,IF(G395=\"\",H395,G395))))))","v":1},{"$nulls":3},1,null,"原薬は脂溶性",null,"ゼチーア錠１０ｍｇ","院内採用"]
["セディ－ル錠１０ｍｇ",null,null,"▲",1,{"$f":"IF(G396&H396&I396&I396&J396&K396=\"\",\"\",IF(G396&H396&I396&J396=\"\",K396,IF(G396&H396&I396=\"\",J396,(IF(G396&H396=\"\",I396,IF(G396=\"\",H396,G396))))))","v":1},null,1,{"$nulls":5},"セディ－ル錠１０ｍｇ","院内採用"]
["セパゾン錠２",null,null,"▲",1,{"$f":"IF(G397&H397&I397&I397&J397&K397=\"\",\"\",IF(G397&H397&I397&J397=\"\",K397,IF(G397&H397&I397=\"\",J397,(IF(G397&H397=\"\",I397,IF(G397=\"\",H397,G397))))))","v":1},null,1,{"$nulls":5},"セパゾン錠２"]
["セパミットR細粒2％",{"$nulls":3},1,null,null,1,{"$nulls":3},"アルカリ性になると力価が下がるため単独で投与","単独投与",null,"院内採用"]
["セファクロルカプセル250mg「サワイ」",{"$nulls":3},1,{"$nulls":3},1,{"$nulls":5},"院内採用"]
["セファドール錠　２５ｍｇ　",null,null,"●",1,{"$f":"IF(G400&H400&I400&I400&J400&K400=\"\",\"\",IF(G400&H400&I400&J400=\"\",K400,IF(G400&H400&I400=\"\",J400,(IF(G400&H400=\"\",I400,IF(G400=\"\",H400,G400))))))","v":1},null,1,{"$nulls":5},"セファドール錠　２５ｍｇ　","院内採用"]
["ｾﾌｧﾗﾝﾁﾝ錠1mg",{"$nulls":3},1,null,null,1]
["セフカペンピボキシル塩酸塩錠100ｍｇ「ファイザー」","マイラン",null,"×",4,{"$f":"IF(G402&H402&I402&I402&J402&K402=\"\",\"\",IF(G402&H402&I402&J402=\"\",K402,IF(G402&H402&I402=\"\",J402,(IF(G402&H402=\"\",I402,IF(G402=\"\",H402,G402))))))","v":1},null,null,1,null,null,"残留粒子あるが押し込める",null,"セフカペンピボキシル塩酸塩錠100ｍｇ「ファイザー」"]
["セフジニル錠100ｍｇ「サワイ」","沢井",null,"●",1,1,null,1,{"$nulls":5},"セフジニル錠100ｍｇ「サワイ」"]
["セフゾン細粒小児用１０％　２００g",{"$nulls":3},1,1,null,1,{"$nulls":5},"セフゾン細粒小児用１０％　２００g","院内採用"]
["セララ錠２５ｍｇ","ファイザー",null,"●",1,1,null,1,{"$nulls":5},"セララ錠２５ｍｇ","院内採用"]
["ゼリットカプセル　１５ｍｇ","ブリストルマイヤーズ",null,"×",4,1,null,1,{"$nulls":3},"HIV 販売中止",null,"ゼリットカプセル　１５ｍｇ"]
["ゼリットカプセル２０ｍｇ","ブリストルマイヤーズ",null,"×",4,1,null,1,{"$nulls":3},"HIV　販売中止",null,"ゼリットカプセル２０ｍｇ"]
["セルシン錠　２ｍｇ",null,null,"●",1,1,null,1,{"$nulls":5},"セルシン錠　２ｍｇ"]
["セルセプトカプセル250ｍｇ","中外",null,"▲",1,1,null,null,1,{"$nulls":4},"セルセプトカプセル250ｍｇ","院内採用"]
["ゼルボラフ錠２４０ｍｇ","ブリストルマイヤーズ",null,"×",6,6,6,{"$nulls":4},"データなし　抗がん剤　　代用薬ないため主治医判断","単独投与　投与器具は毎回破棄　曝露に注意","ゼルボラフ錠２４０ｍｇ"]
["セレキノン錠　１００ｍｇ",null,null,"▲",6,6,null,6,{"$nulls":3},"データなし　錠剤粉砕可",null,"セレキノン錠　１００ｍｇ","院内採用"]
["セレクト－ル錠２００ｍｇ",null,null,"▲",2,2,null,2,{"$nulls":3},"湿度の影響あり","◆投与直前にコーティングに亀裂を入れる◆　","セレクト－ル錠２００ｍｇ"]
["セレコキシブ錠100mg「ファイザー」",{"$nulls":3},2,{"$nulls":3},2,null,null,"セレコックスのAG製剤のため準ずる",null,null,"院内採用"]
["セレコックス錠１００ｍｇ","アステラス",null,"●",2,{"$f":"IF(G414&H414&I414&I414&J414&K414=\"\",\"\",IF(G414&H414&I414&J414=\"\",K414,IF(G414&H414&I414=\"\",J414,(IF(G414&H414=\"\",I414,IF(G414=\"\",H414,G414))))))","v":2},null,null,2,{"$nulls":4},"セレコックス錠１００ｍｇ","院内採用"]
["セレジスト錠５ｍｇ",null,null,"▲",1,1,null,1,{"$nulls":3},"完全に崩壊しないが通過性問題なし",null,"セレジスト錠５ｍｇ"]
["セレスタミン配合錠",null,null,"▲",1,1,null,1,{"$nulls":5},"セレスタミン配合錠","院内採用"]
["セレニカＲ顆粒　４０％",{"$nulls":3},6,6,null,6,{"$nulls":3},"徐放性コーティング顆粒　デパケンSyr.（同成分）・バルプロ酸NaSyr.（同成分）へ変更",null,"セレニカＲ顆粒　４０％","院内採用"]
["セレネース錠　０．７５ｍｇ",null,null,"●",1,1,null,1,{"$nulls":5},"セレネース錠　０．７５ｍｇ","院内採用"]
["ゼローダ錠３００　","中外",null,"×",4,1,null,1,{"$nulls":3},"抗がん剤","単独投与　投与器具は毎回破棄　曝露に注意","ゼローダ錠３００　"]
["セロクラール錠　１０ｍｇ","日医工",null,"▲",6,6,null,null,6,null,null,"20mｇ錠のデータ参照　錠剤粉砕可",null,"セロクラール錠　１０ｍｇ","院内採用"]
["セロケン錠２０ｍｇ",null,null,"▲",1,1,null,1,{"$nulls":5},"セロケン錠２０ｍｇ","院内採用"]
["セロトーン錠１０ｍｇ",null,null,"×",4,1,null,1,{"$nulls":3},"販売中止",null,"セロトーン錠１０ｍｇ"]
["ゼンタコートカプセル10mg",{"$nulls":3},6,{"$nulls":3},6,null,null,"脱カプセルして中の粒をつぶさなければ内服可能　顆粒もPHにより溶解するため、腸溶性はお湯で懸濁しても保たれそう。 　チューブ通過できるかの試験は行っておらず、データなし。"]
["センノサイド錠１２ｍｇ「武田テバ」","大正薬品",null,"●",6,{"$f":"IF(G424&H424&I424&I424&J424&K424=\"\",\"\",IF(G424&H424&I424&J424=\"\",K424,IF(G424&H424&I424=\"\",J424,(IF(G424&H424=\"\",I424,IF(G424=\"\",H424,G424))))))","v":6},null,null,6,null,null,"データなし　ピコスルファートナトリウム内用液（同効）へ変更、粉砕可",null,"センノサイド錠（大正薬品）　１２ｍｇ","院内採用"]
["ゾスパタ錠40mg",{"$nulls":3},1,{"$nulls":3},1,null,null,"抗がん剤","単独投与　投与器具は毎回破棄　曝露に注意"]
["ソセゴン錠２５ｍｇ","丸石",null,"×",4,{"$f":"IF(G426&H426&I426&I426&J426&K426=\"\",\"\",IF(G426&H426&I426&J426=\"\",K426,IF(G426&H426&I426=\"\",J426,(IF(G426&H426=\"\",I426,IF(G426=\"\",H426,G426))))))","v":1},null,null,1,null,null,"向精神薬2種 ソセゴン注あり",null,"ソセゴン錠２５ｍｇ"]
["ソタコール錠４０ｍｇ","ブリストルマイヤーズ",null,"▲",1,{"$f":"IF(G427&H427&I427&I427&J427&K427=\"\",\"\",IF(G427&H427&I427&J427=\"\",K427,IF(G427&H427&I427=\"\",J427,(IF(G427&H427=\"\",I427,IF(G427=\"\",H427,G427))))))","v":1},null,null,1,{"$nulls":4},"ソタコール錠４０ｍｇ","院内採用"]
["ゾビラックス錠　２００ｍｇ",null,null,"▲",1,{"$f":"IF(G428&H428&I428&I428&J428&K428=\"\",\"\",IF(G428&H428&I428&J428=\"\",K428,IF(G428&H428&I428=\"\",J428,(IF(G428&H428=\"\",I428,IF(G428=\"\",H428,G428))))))","v":1},null,1,{"$nulls":5},"ゾビラックス錠　２００ｍｇ","院内採用"]
["ソブリアードカプセル100ｍｇ","ヤンセン",null,"×",6,{"$f":"IF(G429&H429&I429&I429&J429&K429=\"\",\"\",IF(G429&H429&I429&J429=\"\",K429,IF(G429&H429&I429=\"\",J429,(IF(G429&H429=\"\",I429,IF(G429=\"\",H429,G429))))))","v":6},{"$nulls":3},6,null,"データなし　症例あった時に主治医と相談　販売中止",null,"ソブリアードカプセル100ｍｇ"]
["ゾフルーザ錠10mg",{"$nulls":3},6,{"$nulls":3},6,null,null,"他のインフルエンザ治療薬へ　遮光保存すれば可",null,null,"院内採用"]
["ゾフルーザ錠20mg",{"$nulls":3},6,{"$nulls":3},6,null,null,"他のインフルエンザ治療薬へ　遮光保存すれば可",null,null,"院内採用"]
["ソラナックス０．４ｍｇ錠",null,null,"●",1,{"$f":"IF(G432&H432&I432&I432&J432&K432=\"\",\"\",IF(G432&H432&I432&J432=\"\",K432,IF(G432&H432&I432=\"\",J432,(IF(G432&H432=\"\",I432,IF(G432=\"\",H432,G432))))))","v":1},null,1,{"$nulls":5},"ソラナックス０．４ｍｇ錠"]
["ソランタール錠１００ｍｇ",null,null,"▲",2,2,null,2,{"$nulls":5},"ソランタール錠１００ｍｇ","院内採用"]
["ゾルピデム酒石酸塩OD錠5ｍｇ「サワイ」","沢井",null,"●",1,1,null,1,{"$nulls":5},"ゾルピデム酒石酸塩OD錠5ｍｇ「サワイ」","院内採用"]
["ダイアート錠６０ｍｇ",null,null,"●",1,1,null,1,{"$nulls":5},"ダイアート錠６０ｍｇ"]
["ダイアモックス錠２５０ｍｇ",null,null,"▲",1,1,null,1,{"$nulls":5},"ダイアモックス錠２５０ｍｇ","院内採用"]
["タイケルブ錠　２５０ｍｇ","グラクソ",null,"×",4,1,null,1,1,null,null,"抗がん剤","単独投与　投与器具は毎回破棄　曝露に注意","タイケルブ錠　２５０ｍｇ"]
["ダイフェン配合錠",{"$nulls":3},1,{"$nulls":3},1,{"$nulls":5},"院内採用"]
["タウリン散９８％「大正」",{"$nulls":3},1,{"$f":"IF(G439&H439&I439&I439&J439&K439=\"\",\"\",IF(G439&H439&I439&J439=\"\",K439,IF(G439&H439&I439=\"\",J439,(IF(G439&H439=\"\",I439,IF(G439=\"\",H439,G439))))))","v":1},null,1,{"$nulls":3},"溶けないため振り混ぜながら注入",null,"タウリン散９８％「大正」","院内採用"]
["ダクチル錠５０ｍｇ",null,null,"▲",1,{"$nulls":3},1,{"$nulls":5},"院内採用"]
["タグリッソ錠40mg",{"$nulls":3},6,{"$nulls":3},6,null,null,"データなし　抗がん剤　代用薬ないため主治医判断","単独投与　投与器具は毎回破棄　曝露に注意",null,"院内採用"]
["タグリッソ錠80mg",{"$nulls":3},6,{"$nulls":3},6,null,null,"データなし　抗がん剤　代用薬ないため主治医判断","単独投与　投与器具は毎回破棄　曝露に注意",null,"院内採用"]
["ダクルインザ錠60ｍｇ","ブリストルマイヤーズ",null,"×",6,{"$f":"IF(G443&H443&I443&I443&J443&K443=\"\",\"\",IF(G443&H443&I443&J443=\"\",K443,IF(G443&H443&I443=\"\",J443,(IF(G443&H443=\"\",I443,IF(G443=\"\",H443,G443))))))","v":6},{"$nulls":3},6,null,"データなし　症例あった時に主治医と相談",null,"ダグルインザ錠60ｍｇ"]
["タクロリムス錠1mg「あゆみ」",{"$nulls":3},1,{"$nulls":3},1]
["タクロリムス錠3mg「あゆみ」",{"$nulls":3},1,{"$nulls":3},1]
["タケキャブ錠10mg",{"$nulls":3},2,{"$nulls":3},2,{"$nulls":5},"院内採用"]
["タシグナカプセル１５０ｍｇ","ノバルティス",null,"×",4,{"$f":"IF(G447&H447&I447&I447&J447&K447=\"\",\"\",IF(G447&H447&I447&J447=\"\",K447,IF(G447&H447&I447=\"\",J447,(IF(G447&H447=\"\",I447,IF(G447=\"\",H447,G447))))))","v":1},null,1,{"$nulls":3},"抗がん剤","単独投与　投与器具は毎回破棄　曝露に注意","タシグナカプセル１５０ｍｇ","院内採用"]
["タシグナカプセル２００ｍｇ","ノバルティス",null,"×",4,{"$f":"IF(G448&H448&I448&I448&J448&K448=\"\",\"\",IF(G448&H448&I448&J448=\"\",K448,IF(G448&H448&I448=\"\",J448,(IF(G448&H448=\"\",I448,IF(G448=\"\",H448,G448))))))","v":1},null,1,{"$nulls":3},"抗がん剤","単独投与　投与器具は毎回破棄　曝露に注意","タシグナカプセル２００ｍｇ","院内採用"]
["タナドーパ顆粒　１g",{"$nulls":3},6,{"$f":"IF(G449&H449&I449&I449&J449&K449=\"\",\"\",IF(G449&H449&I449&J449=\"\",K449,IF(G449&H449&I449=\"\",J449,(IF(G449&H449=\"\",I449,IF(G449=\"\",H449,G449))))))","v":6},null,6,{"$nulls":3},"データなし　イノバン・ドブトレックス・ドブポン（すべて同効）などの注射へ変更",null,"タナド－パ顆粒　１g"]
["タナトリル錠５",null,null,"●",2,{"$f":"IF(G450&H450&I450&I450&J450&K450=\"\",\"\",IF(G450&H450&I450&J450=\"\",K450,IF(G450&H450&I450=\"\",J450,(IF(G450&H450=\"\",I450,IF(G450=\"\",H450,G450))))))","v":2},null,2,{"$nulls":5},"タナトリル錠５"]
["タフィンラーカプセル50mg",{"$nulls":3},6,{"$nulls":3},6,null,null,"抗がん剤 代用薬ないため主治医判断　データなし","単独投与　投与器具は毎回破棄　曝露に注意"]
["タフィンラーカプセル75mg",{"$nulls":3},6,{"$nulls":3},6,null,null,"抗がん剤 代用薬ないため主治医判断　データなし","単独投与　投与器具は毎回破棄　曝露に注意"]
["ダフクリア錠200mg",{"$nulls":3},1,{"$nulls":3},1]
["タミフルカプセル７５ｍｇ",null,null,"×",4,{"$f":"IF(G454&H454&I454&I454&J454&K454=\"\",\"\",IF(G454&H454&I454&J454=\"\",K454,IF(G454&H454&I454=\"\",J454,(IF(G454&H454=\"\",I454,IF(G454=\"\",H454,G454))))))","v":1},null,1,{"$nulls":5},"タミフルカプセル７５ｍｇ"]
["タミフルドライシロップ３％","中外",null,null,1,{"$f":"IF(G455&H455&I455&I455&J455&K455=\"\",\"\",IF(G455&H455&I455&J455=\"\",K455,IF(G455&H455&I455=\"\",J455,(IF(G455&H455=\"\",I455,IF(G455=\"\",H455,G455))))))","v":1},{"$nulls":3},1,{"$nulls":3},"タミフルドライシロップ３％","院内採用"]
["タムスロシン塩酸塩OD錠0.2mg「サワイ」",null,null,"●",1,{"$f":"IF(G456&H456&I456&I456&J456&K456=\"\",\"\",IF(G456&H456&I456&J456=\"\",K456,IF(G456&H456&I456=\"\",J456,(IF(G456&H456=\"\",I456,IF(G456=\"\",H456,G456))))))","v":1},null,null,1,null,null,"徐放性のため粒子を砕かないように",null,null,"院内採用"]
["ダラシンカプセル　１５０ｍｇ",null,null,"●",1,{"$f":"IF(G457&H457&I457&I457&J457&K457=\"\",\"\",IF(G457&H457&I457&J457=\"\",K457,IF(G457&H457&I457=\"\",J457,(IF(G457&H457=\"\",I457,IF(G457=\"\",H457,G457))))))","v":1},null,1,{"$nulls":5},"ダラシンカプセル　１５０ｍｇ","院内採用"]
["タリージェ錠15mg",{"$nulls":3},3,{"$nulls":3},3]
["タリージェ錠5mg",{"$nulls":3},3,{"$nulls":3},3,{"$nulls":5},"院内採用"]
["タリオン錠１０　１０ｍｇ","田辺三菱",null,"●",6,{"$f":"IF(G460&H460&I460&I460&J460&K460=\"\",\"\",IF(G460&H460&I460&J460=\"\",K460,IF(G460&H460&I460=\"\",J460,(IF(G460&H460=\"\",I460,IF(G460=\"\",H460,G460))))))","v":6},null,null,6,null,null,"データなし　錠剤粉砕可",null,"タリオン錠１０　１０ｍｇ"]
["タルグレチンカプセル　75mg",{"$nulls":3},6,{"$nulls":3},6,null,null,"データなし　抗がん剤　代用薬ないため主治医判断　データなし","単独投与　投与器具は毎回破棄　曝露に注意"]
["タルセバ錠１００ｍｇ","中外",null,"×",4,{"$f":"IF(G462&H462&I462&I462&J462&K462=\"\",\"\",IF(G462&H462&I462&J462=\"\",K462,IF(G462&H462&I462=\"\",J462,(IF(G462&H462=\"\",I462,IF(G462=\"\",H462,G462))))))","v":1},null,1,{"$nulls":3},"抗がん剤","単独投与　投与器具は毎回破棄　曝露に注意","タルセバ錠１００ｍｇ"]
["タルセバ錠１５０ｍｇ","中外",null,"×",4,{"$f":"IF(G463&H463&I463&I463&J463&K463=\"\",\"\",IF(G463&H463&I463&J463=\"\",K463,IF(G463&H463&I463=\"\",J463,(IF(G463&H463=\"\",I463,IF(G463=\"\",H463,G463))))))","v":1},null,1,{"$nulls":3},"抗がん剤","単独投与　投与器具は毎回破棄　曝露に注意","タルセバ錠１５０ｍｇ","院内採用"]
["タルセバ錠２５ｍｇ","中外",null,"×",4,{"$f":"IF(G464&H464&I464&I464&J464&K464=\"\",\"\",IF(G464&H464&I464&J464=\"\",K464,IF(G464&H464&I464=\"\",J464,(IF(G464&H464=\"\",I464,IF(G464=\"\",H464,G464))))))","v":1},null,1,{"$nulls":3},"抗がん剤","単独投与　投与器具は毎回破棄　曝露に注意","タルセバ錠２５ｍｇ"]
["タルチレリンOD錠5mg「サワイ」",{"$nulls":3},1,{"$nulls":3},1,{"$nulls":5},"院内採用"]
["ダルメートカプセル15",{"$nulls":3},1,{"$nulls":3},1]
["炭酸ランタンOD錠250mg「フソー」",{"$nulls":3},1,{"$nulls":3},1,{"$nulls":5},"院内採用"]
["ダントリウムカプセル２５",null,null,"▲",1,{"$f":"IF(G468&H468&I468&I468&J468&K468=\"\",\"\",IF(G468&H468&I468&J468=\"\",K468,IF(G468&H468&I468=\"\",J468,(IF(G468&H468=\"\",I468,IF(G468=\"\",H468,G468))))))","v":1},null,1,{"$nulls":5},"ダントリウムカプセル２５","院内採用"]
["タンニン酸アルブミン「シオエ」","日本新薬","シオエ",null,1,1,null,null,1,null,null,"55℃では凝固するため常温の水で懸濁","常温の水で懸濁","タンニン酸アルブミン","院内採用"]
["タンボコ－ル錠　５０ｍｇ",null,null,"▲",1,1,null,1,{"$nulls":5},"タンボコ－ル錠　５０ｍｇ","院内採用"]
["チザニジン錠1ｍｇ「サワイ」","沢井",null,"▲",1,1,null,1,{"$nulls":5},"チザニジン錠1ｍｇ「サワイ」","院内採用"]
["チャンピックス錠０．５ｍｇ","ファイザー",null,"×",4,1,null,null,1,null,null,"フラッシュ120ｍｌ必要（ガストロは詰まるかも）",null,"チャンピックス錠０．５ｍｇ","院内採用"]
["チャンピックス錠１ｍｇ","ファイザー",null,"×",4,1,null,null,1,null,null,"フラッシュ120ｍｌ必要（ガストロは詰まるかも）",null,"チャンピックス錠１ｍｇ","院内採用"]
["チラーヂンS錠25μg",{"$nulls":3},2,null,null,2]
["チラ－ヂンＳ錠５０",null,null,"●",2,{"$f":"IF(G475&H475&I475&I475&J475&K475=\"\",\"\",IF(G475&H475&I475&J475=\"\",K475,IF(G475&H475&I475=\"\",J475,(IF(G475&H475=\"\",I475,IF(G475=\"\",H475,G475))))))","v":2},null,2,{"$nulls":5},"チラ－ヂンＳ錠５０","院内採用"]
["チロナミン錠　５μg",null,null,"●",1,{"$f":"IF(G476&H476&I476&I476&J476&K476=\"\",\"\",IF(G476&H476&I476&J476=\"\",K476,IF(G476&H476&I476=\"\",J476,(IF(G476&H476=\"\",I476,IF(G476=\"\",H476,G476))))))","v":1},null,1,{"$nulls":3},"25μｇ参照",null,"チロナミン錠　５μg","院内採用"]
["沈降炭酸カルシウム錠　500mg「三和」",{"$nulls":3},1,{"$nulls":5},1,{"$nulls":3},"院内採用"]
["ツムラ甘麦大棗湯エキス顆粒",{"$nulls":3},1,null,null,1,1]
["ツムラ黄連解毒湯エキス顆粒",{"$nulls":3},1,{"$nulls":3},1,{"$nulls":5},"院内採用"]
["ツムラ葛根湯加川きゅう辛夷エキス顆粒(医療用)","ファイザ-",null,null,1,{"$f":"IF(G480&H480&I480&I480&J480&K480=\"\",\"\",IF(G480&H480&I480&J480=\"\",K480,IF(G480&H480&I480=\"\",J480,(IF(G480&H480=\"\",I480,IF(G480=\"\",H480,G480))))))","v":1},null,1,{"$nulls":5},"硫酸ポリミキシンＢ錠100万単位"]
["ツムラ川きゅう茶調散エキス顆粒",{"$nulls":3},1,{"$nulls":3},1]
["ツムラ三物黄苓湯顆粒",{"$nulls":3},1,{"$nulls":3},1]
["ツムラ麻子仁丸エキス顆粒",{"$nulls":3},1,null,null,1,1]
["ツムラ抑肝散加陳皮半夏エキス顆粒",{"$nulls":3},1,{"$nulls":3},1]
["ツムラ苓桂朮甘湯エキス顆粒",{"$nulls":3},1,null,1,1]
["ツムラ葛根湯エキス顆粒（医療用）",{"$nulls":3},1,{"$f":"IF(G486&H486&I486&I486&J486&K486=\"\",\"\",IF(G486&H486&I486&J486=\"\",K486,IF(G486&H486&I486=\"\",J486,(IF(G486&H486=\"\",I486,IF(G486=\"\",H486,G486))))))","v":1},null,1,{"$nulls":5},"ツムラ葛根湯エキス顆粒（医療用）","院内採用"]
["ツムラ五苓散エキス顆粒（医療用）",{"$nulls":3},1,1,null,1,{"$nulls":5},"ツムラ五苓散エキス顆粒（医療用）","院内採用"]
["ツムラ清心蓮子飲エキス顆粒",{"$nulls":3},1,1,null,1,{"$nulls":5},"ツムラ清心蓮子飲エキス顆粒"]
["ツムラ大建中湯エキス顆粒",{"$nulls":3},1,1,null,1,{"$nulls":5},"ツムラ大建中湯エキス顆粒","院内採用"]
["ツムラ猪苓湯エキス顆粒",{"$nulls":3},1,1,null,1,{"$nulls":5},"ツムラ猪苓湯エキス顆粒"]
["ツムラ麦門冬湯エキス顆粒",{"$nulls":3},1,1,null,1,{"$nulls":5},"ツムラ麦門冬湯エキス顆粒","院内採用"]
["ツムラ八味地黄丸エキス顆粒（医療用）",{"$nulls":3},1,1,null,1,{"$nulls":5},"ツムラ八味地黄丸エキス顆粒（医療用）","院内採用"]
["ツムラ半夏瀉心湯エキス",{"$nulls":3},1,1,null,1,{"$nulls":5},"ツムラ半夏瀉心湯エキス","院内採用"]
["ツムラ補中益気湯エキス顆粒",{"$nulls":3},1,1,null,1,{"$nulls":5},"ツムラ補中益気湯エキス顆粒","院内採用"]
["ツムラ抑肝散エキス顆粒（２．５g/包）",{"$nulls":3},1,1,null,1,{"$nulls":5},"ツムラ抑肝散エキス顆粒（２．５g/包）","院内採用"]
["ツムラ六君子湯エキス顆粒　",{"$nulls":3},1,1,null,1,{"$nulls":5},"ツムラ六君子湯エキス顆粒　１８９包","院内採用"]
["ツルバダ配合錠",{"$nulls":3},3,2,null,2,{"$nulls":6},"院内採用"]
["ティーエスワン配合OD錠T20","大鵬薬品",null,"×",4,1,null,null,1,null,null,"抗がん剤","単独投与　投与器具は毎回破棄　曝露に注意","ティーエスワン配合OD錠T20"]
["ティーエスワン配合OD錠T25","大鵬薬品",null,"×",4,1,null,null,1,null,null,"抗がん剤","単独投与　投与器具は毎回破棄　曝露に注意","ティーエスワン配合OD錠T25"]
["ティーエスワン配合顆粒T２０",{"$nulls":3},1,1,null,1,{"$nulls":3},"抗がん剤","単独投与　投与器具は毎回破棄　曝露に注意","ティ－エスワン配合顆粒T２０"]
["ティーエスワン配合顆粒T２５","大鵬",null,null,1,1,null,null,1,null,null,"抗がん剤","単独投与　投与器具は毎回破棄　曝露に注意","ティ－エスワン配合顆粒T２５"]
["ディレグラ配合錠",{"$nulls":3},6,{"$nulls":3},6,null,null,"徐放層を含む錠剤のため不可　錠剤粉砕不可（フェキソフェナジンは粉砕可）"]
["テオドールドライシロップ20%","田辺三菱",null,null,1,{"$f":"IF(G503&H503&I503&I503&J503&K503=\"\",\"\",IF(G503&H503&I503&J503=\"\",K503,IF(G503&H503&I503=\"\",J503,(IF(G503&H503=\"\",I503,IF(G503=\"\",H503,G503))))))","v":1},1,null,6,null,null,"常温の水5mLに溶解して4Fr.通過したデータあり　溶解すると徐放の剤形が崩れてくるため懸濁してなるべく早く投与","単独投与　常温の水で懸濁し10分待たずにすぐに注入","テオドールドライシロップ20%"]
["テオロング錠１００ｍｇ",null,null,"●",6,{"$f":"IF(G504&H504&I504&I504&J504&K504=\"\",\"\",IF(G504&H504&I504&J504=\"\",K504,IF(G504&H504&I504=\"\",J504,(IF(G504&H504=\"\",I504,IF(G504=\"\",H504,G504))))))","v":6},null,6,{"$nulls":3},"徐放性",null,"テオロング錠１００ｍｇ","院内採用"]
["テオロング錠２００ｍｇ",null,null,"▲",6,{"$f":"IF(G505&H505&I505&I505&J505&K505=\"\",\"\",IF(G505&H505&I505&J505=\"\",K505,IF(G505&H505&I505=\"\",J505,(IF(G505&H505=\"\",I505,IF(G505=\"\",H505,G505))))))","v":6},null,6,{"$nulls":3},"徐放性　",null,"テオロング錠２００ｍｇ","院内採用"]
["デカドロン錠4mg",{"$nulls":3},2,{"$f":"IF(G506&H506&I506&I506&J506&K506=\"\",\"\",IF(G506&H506&I506&J506=\"\",K506,IF(G506&H506&I506=\"\",J506,(IF(G506&H506=\"\",I506,IF(G506=\"\",H506,G506))))))","v":2},null,null,2,{"$nulls":5},"院内採用"]
["デカドロン錠　０．５ｍｇ",null,null,"▲",1,{"$f":"IF(G507&H507&I507&I507&J507&K507=\"\",\"\",IF(G507&H507&I507&J507=\"\",K507,IF(G507&H507&I507=\"\",J507,(IF(G507&H507=\"\",I507,IF(G507=\"\",H507,G507))))))","v":1},null,1,{"$nulls":5},"デカドロン錠　０．５ｍｇ","院内採用"]
["デキストロメトルファン臭化水素酸塩錠15mg「NP」",{"$nulls":3},1,null,null,1,1,{"$nulls":5},"院内採用"]
["テクフィデラカプセル120mg",{"$nulls":3},6,{"$nulls":3},6,null,null,"データなし　代用薬ないため主治医判断"]
["テクフィデラカプセル240mg",{"$nulls":3},6,{"$nulls":3},6,null,null,"データなし　代用薬ないため主治医判断"]
["テグレトール細粒　５０％",{"$nulls":3},1,{"$f":"IF(G511&H511&I511&I511&J511&K511=\"\",\"\",IF(G511&H511&I511&J511=\"\",K511,IF(G511&H511&I511=\"\",J511,(IF(G511&H511=\"\",I511,IF(G511=\"\",H511,G511))))))","v":1},null,1,{"$nulls":3},"多めの水でフラッシュ",null,"テグレトール細粒　５０％","院内採用"]
["テグレトール錠　２００ｍｇ",null,null,"●",1,{"$f":"IF(G512&H512&I512&I512&J512&K512=\"\",\"\",IF(G512&H512&I512&J512=\"\",K512,IF(G512&H512&I512=\"\",J512,(IF(G512&H512=\"\",I512,IF(G512=\"\",H512,G512))))))","v":1},null,1,{"$nulls":5},"テグレトール錠　２００ｍｇ","院内採用"]
["デザレックス錠5mg",{"$nulls":3},6,{"$nulls":3},6,null,null,"データなし　粉砕に関してもデータなしのため主治医と相談、または代替薬として、眠気に関する注意喚起のない抗アレルギー薬（フェキソフェナジン）などへの変更を考慮（※フェキソフェナジンは簡易懸濁不可、粉砕可）。"]
["デシコビ配合錠HT",{"$nulls":3},6,null,null,6,6,null,null,"データなし　HIV　HIV担当者に相談","投与方法は要相談 ",null,"院内採用"]
["デシコビ配合錠LT",{"$nulls":3},6,null,null,6,6,null,null,"データなし　HIV　HIV担当者に相談","投与方法は要相談 "]
["テシプール錠　１ｍｇ",null,null,"▲",1,{"$f":"IF(G516&H516&I516&I516&J516&K516=\"\",\"\",IF(G516&H516&I516&J516=\"\",K516,IF(G516&H516&I516=\"\",J516,(IF(G516&H516=\"\",I516,IF(G516=\"\",H516,G516))))))","v":1},null,1,{"$nulls":5},"テシプール錠　１ｍｇ","院内採用"]
["デジレル錠２５",null,null,"▲",2,2,null,2,{"$nulls":3},"50mｇ参照",null,"デジレル錠２５","院内採用"]
["テネリア錠20ｍｇ","田辺",null,"▲",2,2,null,null,2,{"$nulls":3},"血糖降下薬","テネリア錠20ｍｇ","院内採用"]
["テノーミン　５０ｍｇ",null,null,"▲",1,1,null,1,{"$nulls":5},"テノーミン　５０ｍｇ","院内採用"]
["テノゼット錠300ｍｇ","グラクソ",null,"▲",1,1,null,null,1,{"$nulls":4},"テノゼット錠300ｍｇ"]
["デノタスチュアブル配合錠","第一三共",null,"×",3,2,null,null,2,null,null,"55℃20mL20回以上破壊して10分で懸濁可","しっかり破壊（20回以上たたく）","デノタスチュアブル配合錠","院内採用"]
["デパケンＲ錠１００",null,null,"▲",6,6,null,6,{"$nulls":3},"徐放性　デパケンSyr.（同成分）・バルプロ酸NaSyr.（同成分）へ変更",null,"デパケンＲ錠１００","院内採用"]
["デパケンＲ錠２００",null,null,"●",6,6,null,6,{"$nulls":3},"徐放性　デパケンSyr.（同成分）・バルプロ酸NaSyr.（同成分）へ変更",null,"デパケンＲ錠２００","院内採用"]
["テビケイ錠50ｍｇ","ヴィーブ",null,"×",4,"",{"$nulls":5},"HIV/メーカーにはデータなし　お薬・虎の巻第7版より",null,"テビケイ錠50ｍｇ","院内採用"]
["テプレノンカプセル50ｍｇ「トーワ」","東和",null,"●",1,1,null,1,{"$nulls":5},"テプレノンカプセル50ｍｇ「トーワ」","院内採用"]
["テモカプリル塩酸塩錠２ｍｇ「タカタ」","高田",null,"●",1,1,null,1,{"$nulls":5},"テモカプリル塩酸塩錠２ｍｇ「タカタ」","院内採用"]
["テモダールカプセル１００ｍｇ","MSD",null,"×",4,1,null,1,{"$nulls":3},"抗がん剤","単独投与　投与器具は毎回破棄　曝露に注意","テモダールカプセル１００ｍｇ"]
["テモダールカプセル２０ｍｇ","MSD",null,"×",4,1,null,1,{"$nulls":3},"抗がん剤","単独投与　投与器具は毎回破棄　曝露に注意","テモダールカプセル２０ｍｇ"]
["デュタステリド錠0.5mgAV「DSEP」",{"$nulls":3},1,{"$nulls":3},1,{"$nulls":5},"院内採用"]
["テルミサルタン40mg「DSEP」",{"$nulls":3},2,{"$nulls":3},2,null,null,"先発のミカルディスと同じ（メーカーより）",null,null,"院内採用"]
["トアラセット配合錠「Me」",{"$nulls":3},1,{"$nulls":3},1,{"$nulls":5},"院内採用"]
["トウモロコシデンプン","ファイザ-",null,null,1,{"$f":"IF(G532&H532&I532&I532&J532&K532=\"\",\"\",IF(G532&H532&I532&J532=\"\",K532,IF(G532&H532&I532=\"\",J532,(IF(G532&H532=\"\",I532,IF(G532=\"\",H532,G532))))))","v":1},null,1,{"$nulls":5},"硫酸ポリミキシンＢ錠100万単位","院内採用"]
["ドキサゾシン錠1mg「トーワ」",{"$nulls":3},1,null,null,1,1,{"$nulls":5},"院内採用"]
["ドグマチール錠５０ｍｇ",null,null,"●",1,{"$f":"IF(G534&H534&I534&I534&J534&K534=\"\",\"\",IF(G534&H534&I534&J534=\"\",K534,IF(G534&H534&I534=\"\",J534,(IF(G534&H534=\"\",I534,IF(G534=\"\",H534,G534))))))","v":1},null,1,{"$nulls":3},"100mｇ参照",null,"ドグマチール錠５０ｍｇ"]
["トコフェロールニコチン酸エステルカプセル100mg「トーワ」",{"$nulls":3},1,{"$nulls":3},1,{"$nulls":5},"院内採用"]
["ドネペジル塩酸塩OD錠3mg「明治」",{"$nulls":3},1,{"$nulls":3},1,{"$nulls":5},"院内採用"]
["ドネペジル塩酸塩OD錠5mg「明治」",{"$nulls":3},1,{"$nulls":3},1,{"$nulls":5},"院内採用"]
["ドパストン散９８．５％",{"$nulls":3},1,{"$f":"IF(G538&H538&I538&I538&J538&K538=\"\",\"\",IF(G538&H538&I538&J538=\"\",K538,IF(G538&H538&I538=\"\",J538,(IF(G538&H538=\"\",I538,IF(G538=\"\",H538,G538))))))","v":1},null,1,{"$nulls":3},"ドパミン製剤のため酸化マグネシウム、鉄剤（フェネルミン等）と同時懸濁しない","酸化ﾏｸﾞﾈｼｳﾑ、鉄剤（フェネルミン等）と同時懸濁しない","ドパストン散９８．５％","院内採用"]
["トビエース錠4ｍｇ","ファイザー",null,"×",6,6,null,null,6,null,null,"徐放　ウリトスOD錠（同効）へ変更",null,"トビエース錠4ｍｇ","院内採用"]
["トピナ細粒１０％","協和発酵キリン",null,null,1,1,null,null,1,{"$nulls":4},"トピナ細粒１０％"]
["トピナ錠５０ｍｇ","協和発酵キリン",null,"▲",1,1,null,null,1,{"$nulls":4},"トピナ錠５０ｍｇ","院内採用"]
["ドプスOD錠２００ｍｇ","大日本住友",null,"●",1,1,null,null,1,null,null,"ドパミン製剤のため酸化マグネシウム、鉄剤（フェネルミン等）と同時懸濁しない","酸化ﾏｸﾞﾈｼｳﾑ、鉄剤（フェネルミン等）と同時懸濁しない","ドプスOD錠２００ｍｇ","院内採用"]
["ドプス細粒　２０％","大日本住友",null,null,6,6,6,{"$nulls":4},"データなし　ドプスOD錠（同成分）へ変更",null,"ドプス細粒　２０％"]
["トフラニール錠１０ｍｇ",null,null,"▲",6,6,null,6,{"$nulls":3},"データなし　錠剤粉砕可",null,"トフラニール錠１０ｍｇ","院内採用"]
["ドミン錠",null,null,"▲",1,1,null,1,{"$nulls":5},"ドミン錠","院内採用"]
["トラクリア錠６２．５ｍｇ","アクテリオンファーマ",null,"▲",1,1,null,null,1,{"$nulls":4},"トラクリア錠６２．５ｍｇ"]
["トラセミドOD錠4mg「TE」",{"$nulls":3},1,null,null,1,{"$nulls":6},"院内採用"]
["トラゼンタ錠5ｍｇ","ベーリンガー",null,"▲",1,{"$f":"IF(G548&H548&I548&I548&J548&K548=\"\",\"\",IF(G548&H548&I548&J548=\"\",K548,IF(G548&H548&I548=\"\",J548,(IF(G548&H548=\"\",I548,IF(G548=\"\",H548,G548))))))","v":1},{"$nulls":3},1,null,null,"血糖降下薬","トラゼンタ錠5ｍｇ","院内採用"]
["トラネキサム酸カプセル250mg「トーワ」",{"$nulls":3},1,{"$nulls":3},1]
["トラネキサム酸錠250mg「日医工」",{"$nulls":3},2,{"$nulls":3},2,{"$nulls":5},"院内採用"]
["トラベルミン配合錠",null,null,"●",2,{"$f":"IF(G551&H551&I551&I551&J551&K551=\"\",\"\",IF(G551&H551&I551&J551=\"\",K551,IF(G551&H551&I551=\"\",J551,(IF(G551&H551=\"\",I551,IF(G551=\"\",H551,G551))))))","v":2},null,2,{"$nulls":5},"トラベルミン配合錠","院内採用"]
["トラマールOD錠２５ｍｇ","ファイザー",null,"●",1,{"$f":"IF(G552&H552&I552&I552&J552&K552=\"\",\"\",IF(G552&H552&I552&J552=\"\",K552,IF(G552&H552&I552=\"\",J552,(IF(G552&H552=\"\",I552,IF(G552=\"\",H552,G552))))))","v":1},null,null,1,{"$nulls":4},"トラマールOD錠２５ｍｇ","院内採用"]
["トラムセット配合錠","持田製薬",null,"●",1,{"$f":"IF(G553&H553&I553&I553&J553&K553=\"\",\"\",IF(G553&H553&I553&J553=\"\",K553,IF(G553&H553&I553=\"\",J553,(IF(G553&H553=\"\",I553,IF(G553=\"\",H553,G553))))))","v":1},{"$nulls":3},1,{"$nulls":3},"トラムセット配合錠"]
["ドラ－ル錠１５　１５ｍｇ",null,null,"▲",1,{"$f":"IF(G554&H554&I554&I554&J554&K554=\"\",\"\",IF(G554&H554&I554&J554=\"\",K554,IF(G554&H554&I554=\"\",J554,(IF(G554&H554=\"\",I554,IF(G554=\"\",H554,G554))))))","v":1},null,1,{"$nulls":5},"ドラ－ル錠１５　１５ｍｇ","院内採用"]
["トランサミンカプセル　２５０ｍｇ",null,null,"●",1,{"$f":"IF(G555&H555&I555&I555&J555&K555=\"\",\"\",IF(G555&H555&I555&J555=\"\",K555,IF(G555&H555&I555=\"\",J555,(IF(G555&H555=\"\",I555,IF(G555=\"\",H555,G555))))))","v":1},null,1,{"$nulls":5},"トランサミンカプセル　２５０ｍｇ"]
["トランサミン錠250mg",{"$nulls":3},1,{"$nulls":3},1]
["トリアゾラム錠０．１２５ｍｇ「テバ」","テバ",null,"●",1,{"$f":"IF(G557&H557&I557&I557&J557&K557=\"\",\"\",IF(G557&H557&I557&J557=\"\",K557,IF(G557&H557&I557=\"\",J557,(IF(G557&H557=\"\",I557,IF(G557=\"\",H557,G557))))))","v":1},null,1,{"$nulls":5},"トリアゾラム錠０．１２５ｍｇ「テバ」","院内採用"]
["トリーメク配合錠",{"$nulls":3},3,{"$nulls":6},"HIV　お薬・虎の巻第7版より",null,null,"院内採用"]
["トリプタノ－ル錠　１０ｍｇ",null,null,"●",1,{"$f":"IF(G559&H559&I559&I559&J559&K559=\"\",\"\",IF(G559&H559&I559&J559=\"\",K559,IF(G559&H559&I559=\"\",J559,(IF(G559&H559=\"\",I559,IF(G559=\"\",H559,G559))))))","v":1},null,1,{"$nulls":5},"トリプタノ－ル錠　１０ｍｇ","院内採用"]
["トリヘキシフェニジル塩酸塩錠2mg「アメル」",{"$nulls":3},1,null,null,1,{"$nulls":6},"院内採用"]
["トレドミン錠２５　２５ｍｇ",null,null,"▲",1,{"$f":"IF(G561&H561&I561&I561&J561&K561=\"\",\"\",IF(G561&H561&I561&J561=\"\",K561,IF(G561&H561&I561=\"\",J561,(IF(G561&H561=\"\",I561,IF(G561=\"\",H561,G561))))))","v":1},null,1,{"$nulls":5},"トレドミン錠２５　２５ｍｇ","院内採用"]
["トレリーフOD錠25mg",{"$nulls":3},1,{"$nulls":3},1,null,null,"シリンジを回転させながら施行しないと詰まるという報告あり。詰まると担当看護師から問い合わせある場合は、手技の確認を再度行う必要有り。"]
["トレリーフOD錠50mg",{"$nulls":3},1,{"$nulls":3},1]
["トロペロン錠1ｍｇ",null,null,"▲",1,{"$f":"IF(G564&H564&I564&I564&J564&K564=\"\",\"\",IF(G564&H564&I564&J564=\"\",K564,IF(G564&H564&I564=\"\",J564,(IF(G564&H564=\"\",I564,IF(G564=\"\",H564,G564))))))","v":1},null,1,{"$nulls":5},"トロペロン錠1ｍｇ"]
["ドンペリドン錠１０ｍｇ　「ＥＭＥＣ」",null,null,"●",1,{"$f":"IF(G565&H565&I565&I565&J565&K565=\"\",\"\",IF(G565&H565&I565&J565=\"\",K565,IF(G565&H565&I565=\"\",J565,(IF(G565&H565=\"\",I565,IF(G565=\"\",H565,G565))))))","v":1},null,1,{"$nulls":5},"ドンペリドン錠１０ｍｇ　「ＥＭＥＣ」","院内採用"]
["ナイキサン錠　１００ｍｇ",null,null,"●",1,{"$f":"IF(G566&H566&I566&I566&J566&K566=\"\",\"\",IF(G566&H566&I566&J566=\"\",K566,IF(G566&H566&I566=\"\",J566,(IF(G566&H566=\"\",I566,IF(G566=\"\",H566,G566))))))","v":1},null,1,{"$nulls":5},"ナイキサン錠　１００ｍｇ","院内採用"]
["ナウゼリンドライシロップ1%","協和発酵キリン",null,null,1,{"$f":"IF(G567&H567&I567&I567&J567&K567=\"\",\"\",IF(G567&H567&I567&J567=\"\",K567,IF(G567&H567&I567=\"\",J567,(IF(G567&H567=\"\",I567,IF(G567=\"\",H567,G567))))))","v":1},1,{"$nulls":5},"単独投与　常温の水で懸濁","ナウゼリンドライシロップ1%"]
["ナフトピジルＯＤ錠25mg「日医工」",{"$nulls":3},1,{"$nulls":3},1,{"$nulls":5},"院内採用"]
["ニコチン酸アミド散ゾンネ　１０％",{"$nulls":3},1,{"$f":"IF(G569&H569&I569&I569&J569&K569=\"\",\"\",IF(G569&H569&I569&J569=\"\",K569,IF(G569&H569&I569=\"\",J569,(IF(G569&H569=\"\",I569,IF(G569=\"\",H569,G569))))))","v":1},null,1,{"$nulls":5},"ニコチン酸アミド散ゾンネ　１０％"]
["ニコランジル錠5ｍｇ「トーワ」","日医工",null,"●",1,{"$f":"IF(G570&H570&I570&I570&J570&K570=\"\",\"\",IF(G570&H570&I570&J570=\"\",K570,IF(G570&H570&I570=\"\",J570,(IF(G570&H570=\"\",I570,IF(G570=\"\",H570,G570))))))","v":1},null,1,{"$nulls":5},"ニコランジル錠5ｍｇ「日医工」","院内採用"]
["ニセルゴリン錠5mg「日医工」",{"$nulls":3},2,{"$nulls":3},2,{"$nulls":5},"院内採用"]
["ニッパスカルシウム顆粒１００％","田辺三菱",null,null,6,{"$f":"IF(G572&H572&I572&I572&J572&K572=\"\",\"\",IF(G572&H572&I572&J572=\"\",K572,IF(G572&H572&I572=\"\",J572,(IF(G572&H572=\"\",I572,IF(G572=\"\",H572,G572))))))","v":6},6,{"$nulls":4},"データなし　代用薬ないため主治医判断",null,"ニッパスカルシウム顆粒１００％"]
["ニトロール錠　５ｍｇ",null,null,"▲",1,1,null,1,{"$nulls":5},"ニトロール錠　５ｍｇ","院内採用"]
["ニトロペン舌下錠　０．３ｍｇ","日本化薬",null,"×",6,6,6,{"$nulls":4},"特殊　簡易懸濁対象外",null,"ニトロペン舌下錠　０．３ｍｇ","院内採用"]
["ニバジール錠２ｍｇ",null,null,"▲",1,1,null,1,{"$nulls":3},"4mｇ参照",null,"ニバジール錠２ｍｇ","院内採用"]
["ニフェジピンCR錠２０ｍｇ「日医工」","日医工",null,"●",6,6,6,{"$nulls":4},"徐放　セパミットR細粒2％（同効薬）へ変更※CR分1　R分2製剤",null,"ニフェジピンCR錠２０ｍｇ「日医工」","院内採用"]
["ニポラジン錠　３ｍｇ　",null,null,"▲",1,1,null,1,{"$nulls":5},"ニポラジン錠　３ｍｇ　"]
["ニュ－ロタン錠　５０ｍｇ",null,null,"●",2,2,null,2,{"$nulls":5},"ニュ－ロタン錠　５０ｍｇ"]
["ニンラーロカプセル2.3mg",{"$nulls":3},6,{"$nulls":3},6,null,null,"データなし　　抗がん剤　代用薬ないため主治医判断　","単独投与　投与器具は毎回破棄　曝露に注意",null,"院内採用"]
["ニンラーロカプセル3mg",{"$nulls":3},6,{"$nulls":3},6,null,null,"データなし　　抗がん剤　代用薬ないため主治医判断　","単独投与　投与器具は毎回破棄　曝露に注意",null,"院内採用"]
["ニンラーロカプセル4mg",{"$nulls":3},6,{"$nulls":3},6,null,null,"データなし　　抗がん剤　代用薬ないため主治医判断　","単独投与　投与器具は毎回破棄　曝露に注意",null,"院内採用"]
["ネイリンカプセル100mg",{"$nulls":3},1,{"$nulls":3},1,{"$nulls":5},"院内採用"]
["ネオーラル50mgカプセル",null,null,"×",6,{"$f":"IF(G583&H583&I583&I583&J583&K583=\"\",\"\",IF(G583&H583&I583&J583=\"\",K583,IF(G583&H583&I583=\"\",J583,(IF(G583&H583=\"\",I583,IF(G583=\"\",H583,G583))))))","v":6},6,null,2,null,null,"ネオーラル内用液（同成分）へ変更　中身を全て洗い出せば簡易懸濁可能だが実用的でない"]
["ネオーラルカプセル２５ｍｇ",null,null,"×",6,{"$f":"IF(G584&H584&I584&I584&J584&K584=\"\",\"\",IF(G584&H584&I584&J584=\"\",K584,IF(G584&H584&I584=\"\",J584,(IF(G584&H584=\"\",I584,IF(G584=\"\",H584,G584))))))","v":6},6,1,{"$nulls":3},"ネオーラル内用液（同成分）へ変更　中身を全て洗い出せば簡易懸濁可能だが実用的でない",null,"ネオ－ラル２５ｍｇ","院内採用"]
["ネキシウムカプセル２０ｍｇ",null,null,"●",1,{"$f":"IF(G585&H585&I585&I585&J585&K585=\"\",\"\",IF(G585&H585&I585&J585=\"\",K585,IF(G585&H585&I585=\"\",J585,(IF(G585&H585=\"\",I585,IF(G585=\"\",H585,G585))))))","v":1},null,1,{"$nulls":3},"常温の水で投与可","常温の水で懸濁","ネキシウムカプセル２０ｍｇ","院内採用"]
["ネキシウム懸濁用顆粒分包10mg",{"$nulls":3},1,null,null,1,{"$nulls":4},"常温の水で懸濁",null,"院内採用"]
["ネクサバール錠２００ｍｇ","バイエル",null,"×",6,{"$f":"IF(G587&H587&I587&I587&J587&K587=\"\",\"\",IF(G587&H587&I587&J587=\"\",K587,IF(G587&H587&I587=\"\",J587,(IF(G587&H587=\"\",I587,IF(G587=\"\",H587,G587))))))","v":6},null,6,{"$nulls":3},"抗がん剤/懸濁はするがチューブ閉塞　代用薬ないため主治医判断","単独投与　投与器具は毎回破棄　曝露に注意","ネクサバール錠２００ｍｇ","院内採用"]
["ネシーナ錠　１２．５ｍｇ","武田",null,"●",2,{"$f":"IF(G588&H588&I588&I588&J588&K588=\"\",\"\",IF(G588&H588&I588&J588=\"\",K588,IF(G588&H588&I588=\"\",J588,(IF(G588&H588=\"\",I588,IF(G588=\"\",H588,G588))))))","v":2},null,null,2,{"$nulls":3},"血糖降下薬","ネシーナ錠　１２．５ｍｇ","院内採用"]
["ノアルテン錠5mg",{"$nulls":3},1,null,null,1,{"$nulls":3},"10分で崩壊というデータがあるため、溶けにくいとい問い合わせあれば、10分放置するよう説明。","通常より時間をかけて懸濁"]
["ノイエルカプセル　２００ｍｇ",null,null,"●",1,{"$f":"IF(G590&H590&I590&I590&J590&K590=\"\",\"\",IF(G590&H590&I590&J590=\"\",K590,IF(G590&H590&I590=\"\",J590,(IF(G590&H590=\"\",I590,IF(G590=\"\",H590,G590))))))","v":1},null,1,{"$nulls":5},"ノイエルカプセル　２００ｍｇ"]
["ノイキノン錠１０ｍｇ　",null,null,"●",1,{"$f":"IF(G591&H591&I591&I591&J591&K591=\"\",\"\",IF(G591&H591&I591&J591=\"\",K591,IF(G591&H591&I591=\"\",J591,(IF(G591&H591=\"\",I591,IF(G591=\"\",H591,G591))))))","v":1},null,1,{"$nulls":5},"ノイキノン錠１０ｍｇ　"]
["ノイロトロピン錠　４単位　",null,null,"▲",6,{"$f":"IF(G592&H592&I592&I592&J592&K592=\"\",\"\",IF(G592&H592&I592&J592=\"\",K592,IF(G592&H592&I592=\"\",J592,(IF(G592&H592=\"\",I592,IF(G592=\"\",H592,G592))))))","v":6},null,6,{"$nulls":3},"データなし　錠剤粉砕可",null,"ノイロトロピン錠　４単位　","院内採用"]
["ノウリアスト錠20ｍｇ","協和発酵キリン",null,"▲",1,{"$f":"IF(G593&H593&I593&I593&J593&K593=\"\",\"\",IF(G593&H593&I593&J593=\"\",K593,IF(G593&H593&I593=\"\",J593,(IF(G593&H593=\"\",I593,IF(G593=\"\",H593,G593))))))","v":1},null,null,1,null,null,"光に不安定",null,"ノウリアスト錠20ｍｇ","院内採用"]
["ノクサフィル錠100mg",null,null,"×",6,{"$nulls":3},6,null,null,"腸溶錠のため不可　代替薬は同効薬フルコナゾール・イトラコナゾール（簡易懸濁可）",null,null,"院内採用"]
["ノバミン錠５ｍｇ",null,null,"●",1,{"$f":"IF(G595&H595&I595&I595&J595&K595=\"\",\"\",IF(G595&H595&I595&J595=\"\",K595,IF(G595&H595&I595=\"\",J595,(IF(G595&H595=\"\",I595,IF(G595=\"\",H595,G595))))))","v":1},null,1,{"$nulls":5},"ノバミン錠５ｍｇ","院内採用"]
["ノ－ビア錠１００ｍｇ","アッヴィ",null,"×",6,{"$f":"IF(G596&H596&I596&I596&J596&K596=\"\",\"\",IF(G596&H596&I596&J596=\"\",K596,IF(G596&H596&I596=\"\",J596,(IF(G596&H596=\"\",I596,IF(G596=\"\",H596,G596))))))","v":6},null,null,6,null,null,"HIV　カレトラ粉砕によりリトナビルのAUCが39%低下したため不適　　HIV担当者に相談","投与方法は要相談","ノ－ビア錠１００ｍｇ"]
["ノベルジン錠　25mg・50mg",{"$nulls":3},1,{"$nulls":3},1,{"$nulls":5},"院内採用"]
["ノルバデックス錠２０ｍｇ",null,null,"×",4,{"$f":"IF(G598&H598&I598&I598&J598&K598=\"\",\"\",IF(G598&H598&I598&J598=\"\",K598,IF(G598&H598&I598=\"\",J598,(IF(G598&H598=\"\",I598,IF(G598=\"\",H598,G598))))))","v":1},null,1,{"$nulls":3},"抗がん剤","単独投与　投与器具は毎回破棄　曝露に注意","ノルバデックス錠２０ｍｇ","院内採用"]
["ハーフジゴキシンKY錠0.125",{"$nulls":3},1,null,null,1,{"$nulls":6},"院内採用"]
["ハーボニー配合錠",{"$nulls":3},6,{"$nulls":3},6,null,null,"データなし　代用薬ないため主治医判断　"]
["パーロデル２．５ｍｇ",null,null,"▲",6,{"$f":"IF(G601&H601&I601&I601&J601&K601=\"\",\"\",IF(G601&H601&I601&J601=\"\",K601,IF(G601&H601&I601=\"\",J601,(IF(G601&H601=\"\",I601,IF(G601=\"\",H601,G601))))))","v":6},null,6,{"$nulls":3},"データなし　錠剤粉砕可",null,"パーロデル２．５ｍｇ","院内採用"]
["バイアスピリン",null,null,"●",6,2,null,2,{"$nulls":3},"ハンドブックでは破壊すれば投与可となっているが、当院で実際に簡易懸濁を行うと腸溶フィルムの残骸が大きい事例が見られたため、簡易懸濁不可とし、アスピリンへの変更を主治医に提案することとする。",null,"バイアスピリン","院内採用"]
["バイカロン錠　２５ｍｇ",null,null,"▲",1,1,null,1,{"$nulls":5},"バイカロン錠　２５ｍｇ"]
["バイシリンG顆粒４０万単位",{"$nulls":3},1,1,null,1,{"$nulls":5},"バイシリンG顆粒４０万単位","院内採用"]
["ハイドレアカプセル",null,null,"×",4,1,null,1,{"$nulls":3},"抗がん剤","単独投与　投与器具は毎回破棄　曝露に注意","ハイドレアカプセル","院内採用"]
["ハイペン錠200ｍｇ　",null,null,"●",1,1,null,1,{"$nulls":5},"ハイペン錠200ｍｇ　"]
["パキシルCR錠12.5ｍｇ","グラクソ",null,"▲",6,6,null,null,6,null,null,"徐放性　ルボックス（同効・SSRI）・レクサプロ（同効・SSRI）へ変更",null,"パキシルCR錠12.5ｍｇ","院内採用"]
["バクタ配合錠",null,null,"●",1,1,null,1,{"$nulls":5},"バクタ配合錠"]
["バップフォ－錠10ｍｇ",null,null,"▲",1,1,null,1,{"$nulls":5},"バップフォ－錠10ｍｇ"]
["パナルジン錠100ｍｇ",null,null,"▲",2,2,null,2,{"$nulls":5},"パナルジン錠100ｍｇ"]
["バファリン配合錠Ａ330",null,null,"×",4,1,null,1,{"$nulls":5},"バファリン配合錠Ａ330"]
["バラクルード錠０．５ｍｇ","ブリストルマイヤーズ",null,"×",4,1,null,null,1,{"$nulls":4},"バラクルード錠０．５ｍｇ"]
["バラシクロビル顆粒50％「アスペン」",{"$nulls":3},6,{"$nulls":3},6,null,null,"データなし　バルトレックス錠（簡易懸濁可）へと変更",null,null,"院内採用"]
["バラシクロビル錠500mg「EE」",{"$nulls":3},2,{"$nulls":3},2,{"$nulls":5},"院内採用"]
["バリキサ錠450mg",{"$nulls":3},3,{"$f":"IF(G615&H615&I615&I615&J615&K615=\"\",\"\",IF(G615&H615&I615&J615=\"\",K615,IF(G615&H615&I615=\"\",J615,(IF(G615&H615=\"\",I615,IF(G615=\"\",H615,G615))))))","v":2},{"$nulls":3},2,null,"岡大（55℃破壊して20分で懸濁）、東大（55℃破壊して5分で懸濁）、メーカー（55℃破壊して10分で懸濁不可）","通常より時間をかけて懸濁",null,"院内採用"]
["バルサルタン錠80ｍｇ「サンド」","サンド",null,"●",1,{"$f":"IF(G616&H616&I616&I616&J616&K616=\"\",\"\",IF(G616&H616&I616&J616=\"\",K616,IF(G616&H616&I616=\"\",J616,(IF(G616&H616=\"\",I616,IF(G616=\"\",H616,G616))))))","v":1},null,null,1,{"$nulls":4},"バルサルタン錠80ｍｇ「サンド」","院内採用"]
["バルトレックス錠500ｍｇ","グラクソ",null,"▲",2,{"$f":"IF(G617&H617&I617&I617&J617&K617=\"\",\"\",IF(G617&H617&I617&J617=\"\",K617,IF(G617&H617&I617=\"\",J617,(IF(G617&H617=\"\",I617,IF(G617=\"\",H617,G617))))))","v":2},null,2,{"$nulls":5},"バルトレックス錠500ｍｇ"]
["バルトレックス顆粒５０％","グラクソ",null,null,6,{"$f":"IF(G618&H618&I618&I618&J618&K618=\"\",\"\",IF(G618&H618&I618&J618=\"\",K618,IF(G618&H618&I618=\"\",J618,(IF(G618&H618=\"\",I618,IF(G618=\"\",H618,G618))))))","v":6},null,null,6,null,null,"通過性悪い　バルトレックス錠（同成分）へ変更",null,"バルトレックス顆粒５０％"]
["ハルナールＤ錠0.2ｍｇ",null,null,"●",1,{"$f":"IF(G619&H619&I619&I619&J619&K619=\"\",\"\",IF(G619&H619&I619&J619=\"\",K619,IF(G619&H619&I619=\"\",J619,(IF(G619&H619=\"\",I619,IF(G619=\"\",H619,G619))))))","v":1},null,1,{"$nulls":5},"ハルナールＤ錠0.2ｍｇ"]
["パルモディア錠0.1mg",{"$nulls":3},1,{"$nulls":3},1,{"$nulls":5},"院内採用"]
["バレイショデンプン","日本新薬",null,null,1,{"$f":"IF(G621&H621&I621&I621&J621&K621=\"\",\"\",IF(G621&H621&I621&J621=\"\",K621,IF(G621&H621&I621=\"\",J621,(IF(G621&H621=\"\",I621,IF(G621=\"\",H621,G621))))))","v":1},{"$nulls":4},1,"他メーカーのものではハンドブックで懸濁可",null,"バレイショデンプン","院内採用"]
["パントシン錠100",null,null,"▲",6,{"$f":"IF(G622&H622&I622&I622&J622&K622=\"\",\"\",IF(G622&H622&I622&J622=\"\",K622,IF(G622&H622&I622=\"\",J622,(IF(G622&H622=\"\",I622,IF(G622=\"\",H622,G622))))))","v":6},null,6,{"$nulls":3},"データなし　錠剤粉砕可",null,"パントシン錠100","院内採用"]
["ビ・シフロール錠0.125ｍｇ","ブリストルマイヤーズ",null,"▲",1,{"$f":"IF(G623&H623&I623&I623&J623&K623=\"\",\"\",IF(G623&H623&I623&J623=\"\",K623,IF(G623&H623&I623=\"\",J623,(IF(G623&H623=\"\",I623,IF(G623=\"\",H623,G623))))))","v":1},{"$nulls":3},1,{"$nulls":3},"ビ・シフロール錠0.125ｍｇ","院内採用"]
["ビ・シフロール錠0.5ｍｇ","ブリストルマイヤーズ",null,"▲",1,{"$f":"IF(G624&H624&I624&I624&J624&K624=\"\",\"\",IF(G624&H624&I624&J624=\"\",K624,IF(G624&H624&I624=\"\",J624,(IF(G624&H624=\"\",I624,IF(G624=\"\",H624,G624))))))","v":1},{"$nulls":3},1,{"$nulls":3},"ビ・シフロール錠0.5ｍｇ","院内採用"]
["ピーゼットシー糖衣錠4mg",{"$nulls":3},1,null,null,1]
["ピオグリタゾン錠15mg「武田デバ」",{"$nulls":3},1,{"$nulls":3},1,{"$nulls":3},"DM薬",null,"院内採用"]
["ビオスリー配合OD錠",{"$nulls":3},1,{"$nulls":3},1,{"$nulls":5},"院内採用"]
["ビクタルビ配合錠",{"$nulls":3},6,{"$nulls":3},6,null,null,"HIV治療薬",null,null,"院内採用"]
["ピコプレップ配合内用剤",{"$nulls":3},6,{"$nulls":3},6,null,null,"簡易懸濁対象外",null,null,"院内採用"]
["ビソプロロールフマル酸塩錠0.625mg「トーワ」",{"$nulls":3},1,{"$nulls":3},1,{"$nulls":5},"院内採用"]
["ビソプロロールフマル酸塩錠2.5mg「トーワ」",{"$nulls":3},1,{"$nulls":3},1,{"$nulls":5},"院内採用"]
["ビソルボン細粒　２％",{"$nulls":3},1,{"$f":"IF(G632&H632&I632&I632&J632&K632=\"\",\"\",IF(G632&H632&I632&J632=\"\",K632,IF(G632&H632&I632=\"\",J632,(IF(G632&H632=\"\",I632,IF(G632=\"\",H632,G632))))))","v":1},null,1,{"$nulls":5},"ビソルボン細粒　２％","院内採用"]
["ビソルボン錠　４ｍｇ",null,null,"●",1,{"$f":"IF(G633&H633&I633&I633&J633&K633=\"\",\"\",IF(G633&H633&I633&J633=\"\",K633,IF(G633&H633&I633=\"\",J633,(IF(G633&H633=\"\",I633,IF(G633=\"\",H633,G633))))))","v":1},null,1,{"$nulls":5},"ビソルボン錠　４ｍｇ"]
["ピタバスタチンCa・OD錠2mg「トーワ」",{"$nulls":3},1,{"$nulls":3},1,{"$nulls":5},"院内採用"]
["ビタメジン配合カプセルＢ２５",null,null,"●",1,{"$f":"IF(G635&H635&I635&I635&J635&K635=\"\",\"\",IF(G635&H635&I635&J635=\"\",K635,IF(G635&H635&I635=\"\",J635,(IF(G635&H635=\"\",I635,IF(G635=\"\",H635,G635))))))","v":1},null,1,{"$nulls":5},"ビタメジン配合カプセルＢ２５"]
["ビタルタミドOD錠80mg「NK」",{"$nulls":3},4,{"$nulls":3},4,{"$nulls":5},"院内採用"]
["ヒダントール錠２５ｍｇ",null,null,"▲",1,{"$f":"IF(G637&H637&I637&I637&J637&K637=\"\",\"\",IF(G637&H637&I637&J637=\"\",K637,IF(G637&H637&I637=\"\",J637,(IF(G637&H637=\"\",I637,IF(G637=\"\",H637,G637))))))","v":1},null,1,{"$nulls":5},"ヒダントール錠２５ｍｇ","院内採用"]
["ピドキサール錠　１０ｍｇ","中外",null,"●",6,{"$f":"IF(G638&H638&I638&I638&J638&K638=\"\",\"\",IF(G638&H638&I638&J638=\"\",K638,IF(G638&H638&I638=\"\",J638,(IF(G638&H638=\"\",I638,IF(G638=\"\",H638,G638))))))","v":6},null,6,{"$nulls":3},"データなし　錠剤粉砕可",null,"ピドキサール錠　１０ｍｇ","院内採用"]
["ビビアント錠２０ｍｇ　","ファイザー",null,"▲",1,{"$f":"IF(G639&H639&I639&I639&J639&K639=\"\",\"\",IF(G639&H639&I639&J639=\"\",K639,IF(G639&H639&I639=\"\",J639,(IF(G639&H639=\"\",I639,IF(G639=\"\",H639,G639))))))","v":1},{"$nulls":3},1,{"$nulls":3},"ビビアント錠２０ｍｇ　","院内採用"]
["ビブラマイシン錠　１００ｍｇ",null,null,"▲",6,{"$f":"IF(G640&H640&I640&I640&J640&K640=\"\",\"\",IF(G640&H640&I640&J640=\"\",K640,IF(G640&H640&I640=\"\",J640,(IF(G640&H640=\"\",I640,IF(G640=\"\",H640,G640))))))","v":6},null,6,{"$nulls":3},"データなし　錠剤粉砕可",null,"ビブラマイシン錠　１００ｍｇ","院内採用"]
["ビムパット錠100mg",{"$nulls":3},1,{"$nulls":3},1,{"$nulls":5},"院内採用"]
["ビムパット錠50mg",{"$nulls":3},1,{"$nulls":3},1]
["ビムパットドライシロップ10％",{"$nulls":3},1,{"$nulls":3},1]
["ピモベンダン錠1.25mg「TE」",{"$nulls":3},1,{"$nulls":3},1,{"$nulls":5},"院内採用"]
["ビラノア錠20mg",{"$nulls":3},6,{"$nulls":3},6,null,null,"10Frのカテーテル通過したが8Frは通過できなかったため。",null,null,"院内採用"]
["ピラマイド原末",{"$nulls":3},1,{"$f":"IF(G646&H646&I646&I646&J646&K646=\"\",\"\",IF(G646&H646&I646&J646=\"\",K646,IF(G646&H646&I646=\"\",J646,(IF(G646&H646=\"\",I646,IF(G646=\"\",H646,G646))))))","v":1},null,1,{"$nulls":5},"ピラマイド","院内採用"]
["ビリアード錠３００ｍｇ","日本たばこ",null,"×",4,{"$f":"IF(G647&H647&I647&I647&J647&K647=\"\",\"\",IF(G647&H647&I647&J647=\"\",K647,IF(G647&H647&I647=\"\",J647,(IF(G647&H647=\"\",I647,IF(G647=\"\",H647,G647))))))","v":1},null,1,{"$nulls":3},"HIV",null,"ビリアード錠３００ｍｇ","院内採用"]
["ピルシカイニド塩酸塩カプセル25mg「サワイ」",{"$nulls":3},1,{"$nulls":3},1]
["ビルトリシド錠600ｍｇ","バイエル",null,"×",4,{"$f":"IF(G649&H649&I649&I649&J649&K649=\"\",\"\",IF(G649&H649&I649&J649=\"\",K649,IF(G649&H649&I649=\"\",J649,(IF(G649&H649=\"\",I649,IF(G649=\"\",H649,G649))))))","v":1},null,1,{"$nulls":5},"ビルトリシド錠600ｍｇ","院内採用"]
["ヒルナミン細粒１０％",{"$nulls":3},1,{"$f":"IF(G650&H650&I650&I650&J650&K650=\"\",\"\",IF(G650&H650&I650&J650=\"\",K650,IF(G650&H650&I650=\"\",J650,(IF(G650&H650=\"\",I650,IF(G650=\"\",H650,G650))))))","v":1},null,1,{"$nulls":3},"ゆっくり注入","ゆっくり注入","ヒルナミン細粒１０％"]
["ピレスパ錠２００ｍｇ","塩野義",null,"▲",1,{"$f":"IF(G651&H651&I651&I651&J651&K651=\"\",\"\",IF(G651&H651&I651&J651=\"\",K651,IF(G651&H651&I651=\"\",J651,(IF(G651&H651=\"\",I651,IF(G651=\"\",H651,G651))))))","v":1},null,1,{"$nulls":5},"ピレスパ錠２００ｍｇ","院内採用"]
["ファスティック錠９０ｍｇ",null,null,"×",4,{"$f":"IF(G652&H652&I652&I652&J652&K652=\"\",\"\",IF(G652&H652&I652&J652=\"\",K652,IF(G652&H652&I652=\"\",J652,(IF(G652&H652=\"\",I652,IF(G652=\"\",H652,G652))))))","v":1},null,1,{"$nulls":5},"ファスティック錠９０ｍｇ"]
["ファモチジンＤ錠20ｍｇ「サワイ」",null,null,"●",1,{"$f":"IF(G653&H653&I653&I653&J653&K653=\"\",\"\",IF(G653&H653&I653&J653=\"\",K653,IF(G653&H653&I653=\"\",J653,(IF(G653&H653=\"\",I653,IF(G653=\"\",H653,G653))))))","v":1},null,1,{"$nulls":5},"ファモチジンＤ錠20ｍｇ「サワイ」","院内採用"]
["ファリーダックカプセル10mg",{"$nulls":3},6,{"$nulls":3},6,null,null,"データなし　抗がん剤 代用薬ないため主治医判断","単独投与　投与器具は毎回破棄　曝露に注意"]
["ファリーダックカプセル15mg",{"$nulls":3},6,{"$nulls":3},6,null,null,"データなし　抗がん剤 代用薬ないため主治医判断","単独投与　投与器具は毎回破棄　曝露に注意"]
["ファロム錠200ｍｇ",null,null,"▲",6,{"$f":"IF(G656&H656&I656&I656&J656&K656=\"\",\"\",IF(G656&H656&I656&J656=\"\",K656,IF(G656&H656&I656=\"\",J656,(IF(G656&H656=\"\",I656,IF(G656=\"\",H656,G656))))))","v":6},null,6,{"$nulls":3},"データなし　錠剤粉砕可",null,"ファロム錠200ｍｇ","院内採用"]
["フィコンパ錠　２ｍｇ",{"$nulls":3},1,{"$nulls":3},1,null,null,"他剤との配合変化は行っていないため、単独投与","単独投与",null,"院内採用"]
["フィコンパ錠　４ｍｇ",{"$nulls":3},1,{"$nulls":3},1,null,null,"他剤との配合変化は行っていないため、単独投与","単独投与",null,"院内採用"]
["ブイフェンド錠５０ｍｇ","ファイザー",null,"×",4,{"$f":"IF(G659&H659&I659&I659&J659&K659=\"\",\"\",IF(G659&H659&I659&J659=\"\",K659,IF(G659&H659&I659=\"\",J659,(IF(G659&H659=\"\",I659,IF(G659=\"\",H659,G659))))))","v":1},null,1,{"$nulls":5},"ブイフェンド錠５０ｍｇ"]
["フェアストン錠　４０ｍｇ",null,null,"×",4,1,null,1,{"$nulls":3},"抗がん剤","単独投与　投与器具は毎回破棄　曝露に注意","フェアストン錠　４０ｍｇ","院内採用"]
["フェキソフェナジン塩酸塩錠６０ｍｇ「SANIK」","日医工サノフィー",null,"●",1,1,null,1,{"$nulls":3},"データなし　ｱﾚｸﾞﾗのAG製剤　ｱﾚｸﾞﾗはﾊﾝﾄﾞﾌﾞｯｸで簡易懸濁可となっていたため可へ変更（2017/12/28）",null,"フェキソフェナジン塩酸塩錠６０ｍｇ「SANIK」","院内採用"]
["フェネルミン錠50ｍｇ","小林化工",null,"●",2,2,null,null,2,{"$nulls":4},"フェネルミン錠50ｍｇ"]
["フェノバール散　１０％","第一三共",null,null,1,1,null,null,1,{"$nulls":4},"フェノバール散　１０％"]
["フェノバール錠３０ｍｇ","藤永",null,"▲",1,1,null,1,{"$nulls":5},"フェノバール錠３０ｍｇ","院内採用"]
["フェブリク錠２０ｍｇ","帝人ファーマ",null,"●",1,1,null,1,{"$nulls":5},"フェブリク錠２０ｍｇ","院内採用"]
["フェマーラ錠　２．５ｍｇ","ノバルティス",null,"×",4,1,null,1,{"$nulls":3},"抗がん剤","単独投与　投与器具は毎回破棄　曝露に注意","フェマーラ錠　２．５ｍｇ"]
["フェロ・グラデュメット錠１０５ｍｇ　",null,null,"●",6,6,null,6,{"$nulls":3},"多孔性プラスチック製剤（徐放性）　クエン酸第一鉄ナトリウム（50）（同効）・インクレミンSyr.（同効）・フェジン注（同効）へ変更",null,"フェロ・グラデュメット錠１０５ｍｇ　","  "]
["フェロベリン錠","MSD",null,"▲",1,1,null,1,{"$nulls":5},"フェロベリン錠","院内採用"]
["フオイパン錠　１００ｍｇ",null,null,"●",1,1,null,1,{"$nulls":5},"フオイパン錠　１００ｍｇ"]
["フォサマック錠３５ｍｇ","MSD",null,"×",4,1,null,null,1,null,null,"特殊","50mLの55℃温湯で溶解　頭部挙上状態で投与","フォサマック錠３５ｍｇ"]
["フォスブロック錠２５０ｍｇ","協和発酵キリン",null,"●",6,6,null,null,6,null,null,"吸湿性で膨脹　沈降炭酸カルシウム錠（同効）へ変更",null,"フォスブロック錠２５０ｍｇ","院内採用"]
["フォリアミン錠　５ｍｇ",null,null,"▲",1,1,null,1,{"$nulls":5},"フォリアミン錠　５ｍｇ","院内採用"]
["ブシラミン錠100mg「日医工」",{"$nulls":3},2,{"$nulls":3},2,{"$nulls":5},"院内採用"]
["ブスコパン錠　１０ｍｇ",null,null,"▲",1,{"$f":"IF(G674&H674&I674&I674&J674&K674=\"\",\"\",IF(G674&H674&I674&J674=\"\",K674,IF(G674&H674&I674=\"\",J674,(IF(G674&H674=\"\",I674,IF(G674=\"\",H674,G674))))))","v":1},null,1,{"$nulls":5},"ブスコパン錠　１０ｍｇ"]
["ブチルスコポラミン臭化物錠10mg「ツルハラ」",{"$nulls":3},1,{"$nulls":3},1,{"$nulls":5},"院内採用"]
["ブチルスコポラミン臭化物錠10mg「ツルハラ」",{"$nulls":3},1,{"$nulls":3},1,{"$nulls":5},"院内採用"]
["プラケニル錠250mg",{"$nulls":3},3,{"$nulls":3},3,{"$nulls":5},"院内採用"]
["プラザキサカプセル　１１０ｍｇ","ベーリンガー",null,"×",6,{"$f":"IF(G678&H678&I678&I678&J678&K678=\"\",\"\",IF(G678&H678&I678&J678=\"\",K678,IF(G678&H678&I678=\"\",J678,(IF(G678&H678=\"\",I678,IF(G678=\"\",H678,G678))))))","v":6},null,null,6,null,null,"脱カプセルでAUC上昇　イグザレルト（同効）・エリキュース（同効）へ変更",null,"プラザキサカプセル　１１０ｍｇ","院内採用"]
["プラザキサカプセル　７５ｍｇ","ベーリンガー",null,"×",6,6,null,null,6,null,null,"脱カプセルでAUC上昇　イグザレルト（同効）・エリキュース（同効）へ変更",null,"プラザキサカプセル　７５ｍｇ","院内採用"]
["フラジール内服錠　２５０ｍｇ",null,null,"●",6,6,null,6,{"$nulls":3},"データなし　錠剤粉砕可",null,"フラジール内服錠　２５０ｍｇ","院内採用"]
["ブラダロン錠２００ｍｇ",null,null,"▲",1,1,null,1,{"$nulls":5},"ブラダロン錠２００ｍｇ","院内採用"]
["プラノバール",null,null,"▲",1,1,null,1,{"$nulls":5},"プラノバール","院内採用"]
["プラビックス錠２５ｍｇ","サノフィ",null,"▲",2,2,null,2,{"$nulls":5},"プラビックス錠２５ｍｇ"]
["プラビックス錠７５ｍｇ","サノフィ",null,"●",2,2,null,2,{"$nulls":5},"プラビックス錠７５ｍｇ"]
["プラミール錠5mg",null,null,"●",1,1,null,1]
["プラミペキソール塩酸塩LA錠0.375mgMI「サワイ」",{"$nulls":3},6,{"$nulls":3},6,null,null,"徐放錠のため簡易懸濁不可　ビ・シフロール（簡易懸濁可）へ変更"]
["プラミペキソール塩酸塩LA錠1.5mgMI「サワイ」",{"$nulls":3},6,{"$nulls":3},6,null,null,"徐放錠のため簡易懸濁不可　ビ・シフロール（簡易懸濁可）へ変更",null,null,"院内採用"]
["プランルカスト錠１１２．５ｍｇ　「ＥＫ」","小林化工",null,"●",1,{"$f":"IF(G688&H688&I688&I688&J688&K688=\"\",\"\",IF(G688&H688&I688&J688=\"\",K688,IF(G688&H688&I688=\"\",J688,(IF(G688&H688=\"\",I688,IF(G688=\"\",H688,G688))))))","v":1},null,null,1,null,null,"多めの水でフラッシュ",null,"プランルカスト錠１１２．５ｍｇ　「ＥＫ」","院内採用"]
["プリジスタナイーブ錠800ｍｇ","ヤンセン",null,"×",4,{"$f":"IF(G689&H689&I689&I689&J689&K689=\"\",\"\",IF(G689&H689&I689&J689=\"\",K689,IF(G689&H689&I689=\"\",J689,(IF(G689&H689=\"\",I689,IF(G689=\"\",H689,G689))))))","v":1},{"$nulls":3},1,null,"HIV",null,"プリジスタナイーブ錠800ｍｇ"]
["フリバスＯＤ錠２５ｍｇ　",null,null,"●",1,{"$f":"IF(G690&H690&I690&I690&J690&K690=\"\",\"\",IF(G690&H690&I690&J690=\"\",K690,IF(G690&H690&I690=\"\",J690,(IF(G690&H690=\"\",I690,IF(G690=\"\",H690,G690))))))","v":1},null,1,{"$nulls":5},"フリバスＯＤ錠２５ｍｇ　"]
["プリモボラン錠５ｍｇ",null,null,"▲",1,{"$f":"IF(G691&H691&I691&I691&J691&K691=\"\",\"\",IF(G691&H691&I691&J691=\"\",K691,IF(G691&H691&I691=\"\",J691,(IF(G691&H691=\"\",I691,IF(G691=\"\",H691,G691))))))","v":1},null,1,{"$nulls":5},"プリモボラン錠５ｍｇ","院内採用"]
["ブリリンタ錠60mg",{"$nulls":3},2,{"$nulls":3},2,null,null,"投与後はフラッシュが必要","常温の水で懸濁",null,"院内採用"]
["ブリリンタ錠90mg",{"$nulls":3},2,{"$nulls":3},2,null,null,"投与後はフラッシュが必要","常温の水で懸濁",null,"院内採用"]
["プリンペラン錠　５ｍｇ",null,null,"●",1,{"$f":"IF(G694&H694&I694&I694&J694&K694=\"\",\"\",IF(G694&H694&I694&J694=\"\",K694,IF(G694&H694&I694=\"\",J694,(IF(G694&H694=\"\",I694,IF(G694=\"\",H694,G694))))))","v":1},null,1,{"$nulls":5},"プリンペラン錠　５ｍｇ"]
["フルイトラン錠２ｍｇ",null,null,"●",1,{"$f":"IF(G695&H695&I695&I695&J695&K695=\"\",\"\",IF(G695&H695&I695&J695=\"\",K695,IF(G695&H695&I695=\"\",J695,(IF(G695&H695=\"\",I695,IF(G695=\"\",H695,G695))))))","v":1},null,1,{"$nulls":5},"フルイトラン錠２ｍｇ","院内採用"]
["フルコナゾールカプセル１００ｍｇ「サワイ」","沢井",null,"●",1,{"$f":"IF(G696&H696&I696&I696&J696&K696=\"\",\"\",IF(G696&H696&I696&J696=\"\",K696,IF(G696&H696&I696=\"\",J696,(IF(G696&H696=\"\",I696,IF(G696=\"\",H696,G696))))))","v":1},null,1,{"$nulls":5},"フルコナゾールカプセル１００ｍｇ「サワイ」","院内採用"]
["フルダラ錠１０ｍｇ","サノフィ",null,"×",4,{"$f":"IF(G697&H697&I697&I697&J697&K697=\"\",\"\",IF(G697&H697&I697&J697=\"\",K697,IF(G697&H697&I697=\"\",J697,(IF(G697&H697=\"\",I697,IF(G697=\"\",H697,G697))))))","v":1},null,1,{"$nulls":3},"抗がん剤（フルダラ静注あり）","単独投与　投与器具は毎回破棄　曝露に注意","フルダラ錠１０ｍｇ"]
["フルニトラゼパム錠1mg「アメル」",{"$nulls":3},1,{"$nulls":3},1,{"$nulls":5},"院内採用"]
["フルバスタチン錠30ｍｇ「サワイ」","沢井",null,"●",1,{"$f":"IF(G699&H699&I699&I699&J699&K699=\"\",\"\",IF(G699&H699&I699&J699=\"\",K699,IF(G699&H699&I699=\"\",J699,(IF(G699&H699=\"\",I699,IF(G699=\"\",H699,G699))))))","v":1},null,1,{"$nulls":5},"フルバスタチン錠30ｍｇ「サワイ」","院内採用"]
["プレジコビックス配合錠（「院外含む」）",{"$nulls":3},6,null,null,6,6,null,null,"データなし　単剤なら簡易懸濁可能、HIV　HIV担当者に相談","投与方法は要相談 ",null,"院内採用"]
["プレタールＯＤ錠　１００ｍｇ","大塚",null,"●",1,{"$f":"IF(G701&H701&I701&I701&J701&K701=\"\",\"\",IF(G701&H701&I701&J701=\"\",K701,IF(G701&H701&I701=\"\",J701,(IF(G701&H701=\"\",I701,IF(G701=\"\",H701,G701))))))","v":1},null,1,{"$nulls":5},"プレタールＯＤ錠　１００ｍｇ"]
["ブレディニン錠　５０ｍｇ",null,null,"●",1,1,null,1,{"$nulls":3},"残渣あるがフラッシュで通過",null,"ブレディニン錠　５０ｍｇ","院内採用"]
["プレドニゾロン散「タケダ」　１％",{"$nulls":3},1,1,null,1,{"$nulls":5},"プレドニゾロン散「タケダ」　１％","院内採用"]
["プレドニゾロン錠１ｍｇ（旭化成）",null,null,"●",1,1,null,1,{"$nulls":5},"プレドニゾロン錠１ｍｇ（旭化成）","院内採用"]
["プレドニン錠５ｍｇ",null,null,"●",1,1,null,1,{"$nulls":5},"プレドニン錠５ｍｇ","院内採用"]
["プレマリン錠０．６２５ｍｇ",null,null,"▲",6,6,null,6,6,null,null,"データなし　ハンドブックでは懸濁しない　粉砕もデータないため不可　代用薬ないため主治医判断",null,"プレマリン錠０．６２５ｍｇ"]
["プレミネント配合錠ＬＤ","MSD",null,"●",2,2,{"$nulls":3},2,{"$nulls":3},"プレミネント配合錠ＬＤ"]
["プログラフカプセル０．５ｍｇ","アステラス",null,"▲",1,1,{"$nulls":3},1,{"$nulls":3},"プログラフカプセル０．５ｍｇ","院内採用"]
["プログラフカプセル１ｍｇ",null,null,"▲",1,1,null,1,{"$nulls":5},"プログラフカプセル１ｍｇ","院内採用"]
["プログラフ顆粒0.2mg",{"$nulls":3},6,{"$nulls":3},6,null,null,"データなし　ﾊﾝﾄﾞﾌﾞｯｸよりCPは簡易懸濁可　Cpへ変更"]
["プロサイリン錠２０",null,null,"●",1,{"$f":"IF(G711&H711&I711&I711&J711&K711=\"\",\"\",IF(G711&H711&I711&J711=\"\",K711,IF(G711&H711&I711=\"\",J711,(IF(G711&H711=\"\",I711,IF(G711=\"\",H711,G711))))))","v":1},null,1,{"$nulls":5},"プロサイリン錠２０"]
["プロスタール錠２５　２５ｍｇ",null,null,"▲",1,{"$f":"IF(G712&H712&I712&I712&J712&K712=\"\",\"\",IF(G712&H712&I712&J712=\"\",K712,IF(G712&H712&I712=\"\",J712,(IF(G712&H712=\"\",I712,IF(G712=\"\",H712,G712))))))","v":1},null,1,{"$nulls":3},"抗がん剤","単独投与　投与器具は毎回破棄　曝露に注意","プロスタ－ル錠２５　２５ｍｇ","院内採用"]
["プロセキソール錠　０．５ｍｇ","あすか",null,"×",6,{"$f":"IF(G713&H713&I713&I713&J713&K713=\"\",\"\",IF(G713&H713&I713&J713=\"\",K713,IF(G713&H713&I713=\"\",J713,(IF(G713&H713=\"\",I713,IF(G713=\"\",H713,G713))))))","v":6},null,null,6,null,null,"抗がん剤/10分経過後も変化なし　代用薬ないため主治医判断","単独投与　投与器具は毎回破棄　曝露に注意","プロセキソール錠　０．５ｍｇ"]
["フロセミド錠20mg「NP」",null,null,"●",1,{"$f":"IF(G714&H714&I714&I714&J714&K714=\"\",\"\",IF(G714&H714&I714&J714=\"\",K714,IF(G714&H714&I714=\"\",J714,(IF(G714&H714=\"\",I714,IF(G714=\"\",H714,G714))))))","v":1},null,null,1,{"$nulls":5},"院内採用"]
["ブロチゾラムOD錠0.25mg「サワイ」",{"$nulls":3},1,{"$nulls":3},1,{"$nulls":5},"院内採用"]
["プロテカジン錠10","ファイザ-",null,"▲",1,{"$f":"IF(G716&H716&I716&I716&J716&K716=\"\",\"\",IF(G716&H716&I716&J716=\"\",K716,IF(G716&H716&I716=\"\",J716,(IF(G716&H716=\"\",I716,IF(G716=\"\",H716,G716))))))","v":1},null,1,{"$nulls":5},"硫酸ポリミキシンＢ錠100万単位","院内採用"]
["プロパジール錠　５０ｍｇ","中外",null,"▲",6,{"$f":"IF(G717&H717&I717&I717&J717&K717=\"\",\"\",IF(G717&H717&I717&J717=\"\",K717,IF(G717&H717&I717=\"\",J717,(IF(G717&H717=\"\",I717,IF(G717=\"\",H717,G717))))))","v":6},null,null,6,null,null,"55℃20mL20分放置して多めの水でフラッシュすれば懸濁可",null,"プロパジール錠　５０ｍｇ","院内採用"]
["ブロバリン","日本新薬",null,null,6,{"$f":"IF(G718&H718&I718&I718&J718&K718=\"\",\"\",IF(G718&H718&I718&J718=\"\",K718,IF(G718&H718&I718=\"\",J718,(IF(G718&H718=\"\",I718,IF(G718=\"\",H718,G718))))))","v":6},{"$nulls":3},6,null,"シリンジ内に残るため不適　多めにフラッシュするなど主治医と相談",null,"ブロバリン"]
["フロベン錠　４０ｍｇ",null,null,"▲",1,{"$f":"IF(G719&H719&I719&I719&J719&K719=\"\",\"\",IF(G719&H719&I719&J719=\"\",K719,IF(G719&H719&I719=\"\",J719,(IF(G719&H719=\"\",I719,IF(G719=\"\",H719,G719))))))","v":1},null,1,{"$nulls":5},"フロベン錠　４０ｍｇ","院内採用"]
["プロマックＤ錠７５",null,null,"×",4,{"$f":"IF(G720&H720&I720&I720&J720&K720=\"\",\"\",IF(G720&H720&I720&J720=\"\",K720,IF(G720&H720&I720=\"\",J720,(IF(G720&H720=\"\",I720,IF(G720=\"\",H720,G720))))))","v":1},null,1,{"$nulls":5},"プロマックＤ錠７５"]
["ブロムヘキシン塩酸塩錠4mg「日医工」",{"$nulls":3},1,{"$nulls":3},1,{"$nulls":5},"院内採用"]
["ブロムヘキシン塩酸塩錠4mg「日医工」",{"$nulls":3},1,{"$nulls":3},1,{"$nulls":5},"院内採用"]
["フロモックス小児用細粒１００ｍｇ",{"$nulls":3},1,{"$f":"IF(G723&H723&I723&I723&J723&K723=\"\",\"\",IF(G723&H723&I723&J723=\"\",K723,IF(G723&H723&I723=\"\",J723,(IF(G723&H723=\"\",I723,IF(G723=\"\",H723,G723))))))","v":1},null,1,{"$nulls":5},"フロモックス小児用細粒１００ｍｇ","院内採用"]
["フロリネフ錠　０．１ｍｇ",null,null,"●",1,{"$f":"IF(G724&H724&I724&I724&J724&K724=\"\",\"\",IF(G724&H724&I724&J724=\"\",K724,IF(G724&H724&I724=\"\",J724,(IF(G724&H724=\"\",I724,IF(G724=\"\",H724,G724))))))","v":1},null,1,{"$nulls":5},"フロリネフ錠　０．１ｍｇ","院内採用"]
["ベイスンＯＤ錠０．３",null,null,"●",1,{"$f":"IF(G725&H725&I725&I725&J725&K725=\"\",\"\",IF(G725&H725&I725&J725=\"\",K725,IF(G725&H725&I725=\"\",J725,(IF(G725&H725=\"\",I725,IF(G725=\"\",H725,G725))))))","v":1},null,1,{"$nulls":4},"血糖降下薬","ベイスンＯＤ錠０．３"]
["ベージニオ錠100mg",{"$nulls":3},6,{"$nulls":3},6,null,null,"抗がん剤　代用薬ないため主治医判断","単独投与　投与器具は毎回破棄　曝露に注意"]
["ベージニオ錠150mg",{"$nulls":3},6,{"$nulls":3},6,null,null,"抗がん剤　代用薬ないため主治医判断","単独投与　投与器具は毎回破棄　曝露に注意"]
["ベージニオ錠50mg",{"$nulls":3},6,{"$nulls":3},6,null,null,"抗がん剤　代用薬ないため主治医判断","単独投与　投与器具は毎回破棄　曝露に注意"]
["ベオーバ錠50mg",{"$nulls":3},1,{"$nulls":3},1]
["ベゲタミンーＡ配合錠",null,null,"▲",6,{"$f":"IF(G730&H730&I730&I730&J730&K730=\"\",\"\",IF(G730&H730&I730&J730=\"\",K730,IF(G730&H730&I730=\"\",J730,(IF(G730&H730=\"\",I730,IF(G730=\"\",H730,G730))))))","v":6},null,6,{"$nulls":3},"データなし　錠剤粉砕可",null,"ベゲタミンーＡ配合錠"]
["ベゲタミンーＢ配合錠",null,null,"▲",6,{"$f":"IF(G731&H731&I731&I731&J731&K731=\"\",\"\",IF(G731&H731&I731&J731=\"\",K731,IF(G731&H731&I731=\"\",J731,(IF(G731&H731=\"\",I731,IF(G731=\"\",H731,G731))))))","v":6},null,6,{"$nulls":3},"データなし　錠剤粉砕可",null,"ベゲタミンーＢ配合錠"]
["ベサコリン散　５％",{"$nulls":3},1,{"$f":"IF(G732&H732&I732&I732&J732&K732=\"\",\"\",IF(G732&H732&I732&J732=\"\",K732,IF(G732&H732&I732=\"\",J732,(IF(G732&H732=\"\",I732,IF(G732=\"\",H732,G732))))))","v":1},null,1,{"$nulls":5},"ベサコリン散　５％","院内採用"]
["ベザトールＳＲ錠２００ｍｇ",null,null,"●",6,{"$f":"IF(G733&H733&I733&I733&J733&K733=\"\",\"\",IF(G733&H733&I733&J733=\"\",K733,IF(G733&H733&I733=\"\",J733,(IF(G733&H733=\"\",I733,IF(G733=\"\",H733,G733))))))","v":6},null,6,{"$nulls":3},"徐放性　徐放だけど現在粉砕入力可",null,"ベザトールＳＲ錠２００ｍｇ","院内採用"]
["ベサノイドカプセル　１０ｍｇ",null,null,"×",4,{"$f":"IF(G734&H734&I734&I734&J734&K734=\"\",\"\",IF(G734&H734&I734&J734=\"\",K734,IF(G734&H734&I734=\"\",J734,(IF(G734&H734=\"\",I734,IF(G734=\"\",H734,G734))))))","v":1},null,1,{"$nulls":3},"抗がん剤","単独投与　投与器具は毎回破棄　曝露に注意","ベサノイドカプセル　１０ｍｇ","院内採用"]
["ベザフィブラートSR錠200mg「日医工」",{"$nulls":3},6,{"$nulls":3},6,null,null,"本来徐放製剤のため粉砕は望ましくないが、当院でフィブラート系がこの薬剤のみなので当院では粉砕して投与か他の薬剤を検討していただく",null,null,"院内採用"]
["ベシケアＯＤ錠２．５ｍｇ","アステラス",null,"▲",6,{"$f":"IF(G736&H736&I736&I736&J736&K736=\"\",\"\",IF(G736&H736&I736&J736=\"\",K736,IF(G736&H736&I736=\"\",J736,(IF(G736&H736=\"\",I736,IF(G736=\"\",H736,G736))))))","v":6},null,null,6,null,null,"有効成分をコーティングしてるものが沈殿しシリンジ内に残留粒子あり　ウリトスOD錠（同効）へ変更",null,"ベシケアＯＤ錠２．５ｍｇ","院内採用"]
["ベシケアＯＤ錠５ｍｇ","アステラス",null,"●",6,{"$f":"IF(G737&H737&I737&I737&J737&K737=\"\",\"\",IF(G737&H737&I737&J737=\"\",K737,IF(G737&H737&I737=\"\",J737,(IF(G737&H737=\"\",I737,IF(G737=\"\",H737,G737))))))","v":6},null,null,6,null,null,"有効成分をコーティングしてるものが沈殿しシリンジ内に残留粒子あり　ウリトスOD錠（同効）へ変更",null,"ベシケアＯＤ錠５ｍｇ","院内採用"]
["ベタナミン錠１０ｍｇ","三和化学",null,"▲",1,{"$f":"IF(G738&H738&I738&I738&J738&K738=\"\",\"\",IF(G738&H738&I738&J738=\"\",K738,IF(G738&H738&I738=\"\",J738,(IF(G738&H738=\"\",I738,IF(G738=\"\",H738,G738))))))","v":1},null,null,1,{"$nulls":4},"ベタナミン錠１０ｍｇ"]
["ベタニス錠５０ｍｇ","アステラス",null,"▲",6,{"$f":"IF(G739&H739&I739&I739&J739&K739=\"\",\"\",IF(G739&H739&I739&J739=\"\",K739,IF(G739&H739&I739=\"\",J739,(IF(G739&H739=\"\",I739,IF(G739=\"\",H739,G739))))))","v":6},null,null,6,null,null,"徐放剤　ウリトスOD錠（同効）へ変更",null,"ベタニス錠５０ｍｇ","院内採用"]
["ベタヒスチンメシル酸塩錠6mg「日医工」",{"$nulls":3},1,{"$nulls":3},1,{"$nulls":5},"院内採用"]
["ベタヒスチンメシル酸塩錠6mg「日医工」",{"$nulls":3},1,{"$nulls":3},1,{"$nulls":5},"院内採用"]
["ベタメタゾン錠0.5mg",{"$nulls":3},1,{"$nulls":3},1,{"$nulls":5},"院内採用"]
["ベニジピン塩酸塩錠4mg「サワイ」",{"$nulls":3},1,{"$nulls":3},1,{"$nulls":5},"院内採用"]
["ベネシッド錠250mg",{"$nulls":3},1,{"$nulls":3},1]
["ベネット錠75mg",{"$nulls":3},6,{"$nulls":3},6,null,null,"データなし　アレンドロン（同効）へ変更"]
["ヘパアクト配合顆粒",{"$nulls":3},6,{"$nulls":3},6,null,null,"55℃60mlの温湯で懸濁させ、2分間スパーテル等でかき混ぜると8Fr.通過した。詰まりやすいので注入の際は注意する",null,null,"院内採用"]
["ベプシドＳ２５　２５ｍｇ","ブリストルマイヤーズ",null,"×",6,{"$f":"IF(G747&H747&I747&I747&J747&K747=\"\",\"\",IF(G747&H747&I747&J747=\"\",K747,IF(G747&H747&I747=\"\",J747,(IF(G747&H747=\"\",I747,IF(G747=\"\",H747,G747))))))","v":6},null,null,6,null,null,"抗がん剤（カプセルがシリンジに付着）　　代用薬ないため主治医判断","単独投与　投与器具は毎回破棄　曝露に注意","ベプシドＳ２５　２５ｍｇ","院内採用"]
["ヘプセラ錠１０","グラクソ",null,"×",4,{"$f":"IF(G748&H748&I748&I748&J748&K748=\"\",\"\",IF(G748&H748&I748&J748=\"\",K748,IF(G748&H748&I748=\"\",J748,(IF(G748&H748=\"\",I748,IF(G748=\"\",H748,G748))))))","v":1},null,1,1,{"$nulls":4},"ヘプセラ錠１０","院内採用"]
["ベプリコ－ル錠５０ｍｇ",null,null,"▲",1,{"$f":"IF(G749&H749&I749&I749&J749&K749=\"\",\"\",IF(G749&H749&I749&J749=\"\",K749,IF(G749&H749&I749=\"\",J749,(IF(G749&H749=\"\",I749,IF(G749=\"\",H749,G749))))))","v":1},null,1,{"$nulls":5},"ベプリコ－ル錠５０ｍｇ","院内採用"]
["ベポタスチンベシル酸塩OD錠10mg「タナベ」",{"$nulls":3},1,null,null,1,{"$nulls":6},"院内採用"]
["ベムリディ錠25mg",{"$nulls":3},6,{"$nulls":3},6,null,null,"データなし。　錠剤粉砕不可（苦みあり・データないため、粉砕は医師と相談。）　同成分のﾃﾉｾﾞｯﾄは粉砕可。ただしプロドラッグが異なるため細胞内移行率が異なる",null,null,"院内採用"]
["ベラサスＬＡ錠60μg","科研",null,"▲",6,{"$f":"IF(G752&H752&I752&I752&J752&K752=\"\",\"\",IF(G752&H752&I752&J752=\"\",K752,IF(G752&H752&I752=\"\",J752,(IF(G752&H752=\"\",I752,IF(G752=\"\",H752,G752))))))","v":6},null,null,6,null,null,"薬剤全体が徐放  プロサイリン錠（同成分）への変更",null,"ベラサスＬＡ錠60μg"]
["ペラゾリン細粒　４００ｍｇ　０．５g",{"$nulls":3},1,{"$f":"IF(G753&H753&I753&I753&J753&K753=\"\",\"\",IF(G753&H753&I753&J753=\"\",K753,IF(G753&H753&I753=\"\",J753,(IF(G753&H753=\"\",I753,IF(G753=\"\",H753,G753))))))","v":1},null,1,{"$nulls":3},"抗がん剤","単独投与　投与器具は毎回破棄　曝露に注意","ペラゾリン細粒　４００ｍｇ　０．５g","院内採用"]
["ベラパミル塩酸塩錠40mg",{"$nulls":3},2,{"$nulls":3},2,{"$nulls":5},"院内採用"]
["ベラプロストNa錠20μg「サワイ」",{"$nulls":3},1,{"$nulls":3},1,{"$nulls":5},"院内採用"]
["ベリチーム配合顆粒　１g",{"$nulls":3},6,{"$f":"IF(G756&H756&I756&I756&J756&K756=\"\",\"\",IF(G756&H756&I756&J756=\"\",K756,IF(G756&H756&I756=\"\",J756,(IF(G756&H756=\"\",I756,IF(G756=\"\",H756,G756))))))","v":6},null,6,{"$nulls":3},"胃・腸溶混合顆粒　腸溶性の濃厚膵臓性消化酵素は胃酸で失活するため不適　代用薬ないため主治医判断",null,"ベリチーム配合顆粒　１g","院内採用"]
["ペリンドプリル錠４ｍｇ「日医工」","日医工",null,"●",1,1,null,1,{"$nulls":5},"ペリンドプリル錠４ｍｇ「日医工」","院内採用"]
["ペルサンチンＬカプセル　１５０ｍｇ",null,null,"×",6,6,null,6,{"$nulls":3},"徐放性顆粒　最小通過は12Fr.多めの水で顆粒をつぶさないように懸濁しゆっくり注入 ペルサンチン錠（同成分）への変更",null,"ペルサンチンＬカプセル　１５０ｍｇ"]
["ペルサンチン錠２５ｍｇ　",null,null,"▲",1,1,null,1,{"$nulls":5},"ペルサンチン錠２５ｍｇ　","院内採用"]
["ベルソムラ錠15ｍｇ","MSD",null,"×",6,6,{"$nulls":3},6,null,"データなし　ロゼレム（同効）への変更←ロゼレムは高度な肝機能障害やフルボキサミンマレイン酸服用中で禁忌のため注意                どうしても簡易懸濁しなけばいけない場合は、フィルムコーティング錠のため亀裂を入れる必要あり。",null,"ベルソムラ錠15ｍｇ","院内採用"]
["ベルソムラ錠20ｍｇ","MSD",null,"×",6,6,{"$nulls":3},6,null,"データなし　ロゼレム（同効）への変更←ロゼレムは高度な肝機能障害やフルボキサミンマレイン酸服用中で禁忌のため注意　　　　　　　　どうしても簡易懸濁しなけばいけない場合は、フィルムコーティング錠のため亀裂を入れる必要あり。",null,"ベルソムラ錠20ｍｇ"]
["ヘルベッサ－Ｒカプセル１００ｍｇ　",null,null,"●",6,6,null,6,{"$nulls":3},"脱カプセルして中の粒をつぶさず溶かさなければ内服可能　スパンスル型で速効性の粒と徐放性の粒がカプセル内に含まれている 同成分ないため主治医判断",null,"ヘルベッサ－Ｒカプセル１００ｍｇ　"]
["ペルマックス錠２５０μg",null,null,"×",4,1,null,1,{"$nulls":5},"ペルマックス錠２５０μg"]
["ベンザリン錠　５ｍｇ",null,null,"●",1,1,null,1,{"$nulls":5},"ベンザリン錠　５ｍｇ","院内採用"]
["ベンズブロマロン錠50mg「トーワ」",{"$nulls":3},1,{"$nulls":3},1,{"$nulls":5},"院内採用"]
["ペンタサ顆粒94％",{"$nulls":3},1,{"$nulls":3},1,{"$nulls":3},"1包あたり水20mLで懸濁"]
["ペンタサ錠　５００ｍｇ",null,null,"▲",6,{"$f":"IF(G767&H767&I767&I767&J767&K767=\"\",\"\",IF(G767&H767&I767&J767=\"\",K767,IF(G767&H767&I767=\"\",J767,(IF(G767&H767=\"\",I767,IF(G767=\"\",H767,G767))))))","v":6},null,6,{"$nulls":3},"250mｇ参照　多孔性皮膜コーティング顆粒錠（徐放性）　ペンタサ坐剤（同成分）・ペンタサ注腸（同成分）はあるが内服の代用薬ないため主治医判断",null,"ペンタサ錠　５００ｍｇ"]
["ホーネル錠　０．３μg",null,null,"▲",1,{"$f":"IF(G768&H768&I768&I768&J768&K768=\"\",\"\",IF(G768&H768&I768&J768=\"\",K768,IF(G768&H768&I768=\"\",J768,(IF(G768&H768=\"\",I768,IF(G768=\"\",H768,G768))))))","v":1},null,1,{"$nulls":5},"ホーネル錠　０．３μg"]
["ボグリボースOD錠0.3mg「日医工」",null,null,"●",1,{"$f":"IF(G769&H769&I769&I769&J769&K769=\"\",\"\",IF(G769&H769&I769&J769=\"\",K769,IF(G769&H769&I769=\"\",J769,(IF(G769&H769=\"\",I769,IF(G769=\"\",H769,G769))))))","v":1},null,null,1,{"$nulls":3},"血糖降下薬",null,"院内採用"]
["ホスミシン錠５００ｍｇ",null,null,"▲",1,{"$f":"IF(G770&H770&I770&I770&J770&K770=\"\",\"\",IF(G770&H770&I770&J770=\"\",K770,IF(G770&H770&I770=\"\",J770,(IF(G770&H770=\"\",I770,IF(G770=\"\",H770,G770))))))","v":1},null,1,{"$nulls":5},"ホスミシン錠５００ｍｇ","院内採用"]
["ホスリボン配合顆粒",{"$nulls":3},1,{"$nulls":3},1,{"$nulls":3},"常温の水で懸濁",null,"院内採用"]
["ホスレノールOD錠",{"$nulls":3},6,{"$nulls":3},6,null,null,"データなし　沈降炭酸カルシウム（同効）へ変更",null,null,"院内採用"]
["ボセンタン錠６２．５ｍｇ｢ファイザー｣",null,null,"▲",1,{"$nulls":3},1,{"$nulls":5},"院内採用"]
["ボノサップパック　４００",{"$nulls":3},6,{"$nulls":3},6,null,null,"データなし　特殊→アモキシシリン（同成分）・クラリシッド（同成分）・タケキャブ（同成分）：簡易懸濁可",null,null,"院内採用"]
["ボノピオンパック",{"$nulls":3},6,{"$nulls":3},6,null,null,"データなし　特殊→アモキシシリン（同成分）・タケキャブ（同成分）：簡易懸濁可、フラジール（同成分）：簡易懸濁不適のため粉砕へ"]
["ポマリストカプセル2mg",null,null,"×",6,null,6,{"$nulls":4},"データなし　抗がん剤。脱cpも不可。簡易懸濁時は処方医の判断でとメーカーより。　代用薬ないため主治医判断","単独投与　投与器具は毎回破棄　曝露に注意","ポマリストカプセル2mg","院内採用"]
["ポマリストカプセル4mg",null,null,"×",6,null,6,{"$nulls":4},"データなし　抗がん剤。脱cpも不可。簡易懸濁時は処方医の判断でとメーカーより。　代用薬ないため主治医判断","単独投与　投与器具は毎回破棄　曝露に注意","ポマリストカプセル4mg","院内採用"]
["ポラプレジンクOD錠75mg「サワイ」",{"$nulls":3},1,{"$nulls":3},1,{"$nulls":5},"院内採用"]
["ボリコナゾール錠50mg「DSEP」",{"$nulls":3},1,{"$nulls":3},1,{"$nulls":5},"院内採用"]
["ポリスチレンスルホン酸ナトリウム原末",{"$nulls":3},1,{"$nulls":3},1,null,null,"2.5gあたり水20mLで懸濁し直後に注入（10分放置しない)","2.5gあたり水20mLで懸濁しすぐに注入",null,"院内採用"]
["ボルタレンＳＲカプセル　３７．５ｍｇ",null,null,"●",1,{"$f":"IF(G781&H781&I781&I781&J781&K781=\"\",\"\",IF(G781&H781&I781&J781=\"\",K781,IF(G781&H781&I781=\"\",J781,(IF(G781&H781=\"\",I781,IF(G781=\"\",H781,G781))))))","v":1},null,1,{"$nulls":3},"注入速度を遅くすれば8Fr.可","ゆっくり注入","ボルタレンＳＲカプセル　３７．５ｍｇ"]
["ボルタレン錠　２５ｍｇ",null,null,"●",2,{"$f":"IF(G782&H782&I782&I782&J782&K782=\"\",\"\",IF(G782&H782&I782&J782=\"\",K782,IF(G782&H782&I782=\"\",J782,(IF(G782&H782=\"\",I782,IF(G782=\"\",H782,G782))))))","v":2},null,2,{"$nulls":5},"ボルタレン錠　２５ｍｇ"]
["ポルトラック原末　６g",{"$nulls":3},1,{"$f":"IF(G783&H783&I783&I783&J783&K783=\"\",\"\",IF(G783&H783&I783&J783=\"\",K783,IF(G783&H783&I783=\"\",J783,(IF(G783&H783=\"\",I783,IF(G783=\"\",H783,G783))))))","v":1},null,1,{"$nulls":5},"ポルトラック原末　６g","院内採用"]
["ボンゾ－ル錠　２００ｍｇ",null,null,"▲",1,{"$f":"IF(G784&H784&I784&I784&J784&K784=\"\",\"\",IF(G784&H784&I784&J784=\"\",K784,IF(G784&H784&I784=\"\",J784,(IF(G784&H784=\"\",I784,IF(G784=\"\",H784,G784))))))","v":1},null,1,{"$nulls":5},"ボンゾ－ル錠　２００ｍｇ"]
["マイスタン錠５ｍｇ","大日本住友",null,"▲",1,{"$f":"IF(G785&H785&I785&I785&J785&K785=\"\",\"\",IF(G785&H785&I785&J785=\"\",K785,IF(G785&H785&I785=\"\",J785,(IF(G785&H785=\"\",I785,IF(G785=\"\",H785,G785))))))","v":1},{"$nulls":3},1,{"$nulls":3},"マイスタン錠５ｍｇ","院内採用"]
["マイテラーゼ錠10mg",{"$nulls":3},1,{"$nulls":3},1,{"$nulls":5},"院内採用"]
["マイテラ－ゼ　１０ｍｇ",null,null,"▲",1,{"$f":"IF(G787&H787&I787&I787&J787&K787=\"\",\"\",IF(G787&H787&I787&J787=\"\",K787,IF(G787&H787&I787=\"\",J787,(IF(G787&H787=\"\",I787,IF(G787=\"\",H787,G787))))))","v":1},null,1,{"$nulls":3},"錠剤が少し残るがフラッシュで可",null,"マイテラ－ゼ　１０ｍｇ"]
["ﾏｳﾞｨﾚｯﾄ配合錠",{"$nulls":3},6,{"$nulls":3},6,null,null,"ﾃﾞｰﾀなし　代替薬なし主治医と相談"]
["マドパー配合錠",null,null,"●",1,{"$f":"IF(G789&H789&I789&I789&J789&K789=\"\",\"\",IF(G789&H789&I789&J789=\"\",K789,IF(G789&H789&I789=\"\",J789,(IF(G789&H789=\"\",I789,IF(G789=\"\",H789,G789))))))","v":1},null,1,{"$nulls":3},"ドパミン製剤のため酸化マグネシウム、鉄剤（フェネルミン等）と同時懸濁しない","酸化ﾏｸﾞﾈｼｳﾑ、鉄剤（フェネルミン等）と同時懸濁しない","マドパー配合錠","院内採用"]
["マブリン散　１％",{"$nulls":3},1,{"$f":"IF(G790&H790&I790&I790&J790&K790=\"\",\"\",IF(G790&H790&I790&J790=\"\",K790,IF(G790&H790&I790=\"\",J790,(IF(G790&H790=\"\",I790,IF(G790=\"\",H790,G790))))))","v":1},null,1,{"$nulls":3},"抗がん剤","単独投与　投与器具は毎回破棄　曝露に注意","マブリン散　１％","院内採用"]
["マプロチリン塩酸塩錠10mg「アメル」",{"$nulls":3},1,{"$nulls":3},1,{"$nulls":5},"院内採用"]
["マリゼブ錠　25mg",{"$nulls":3},6,{"$nulls":3},6,null,null,"データなし　他のDPP阻害薬検討 ※用法用量注意！","血糖降下薬"]
["ミオナール錠５０ｍｇ　",null,null,"●",2,{"$f":"IF(G793&H793&I793&I793&J793&K793=\"\",\"\",IF(G793&H793&I793&J793=\"\",K793,IF(G793&H793&I793=\"\",J793,(IF(G793&H793=\"\",I793,IF(G793=\"\",H793,G793))))))","v":2},null,2,{"$nulls":5},"ミオナール錠５０ｍｇ　"]
["ミカルディス錠４０ｍｇ","ベーリンガー",null,"●",2,{"$f":"IF(G794&H794&I794&I794&J794&K794=\"\",\"\",IF(G794&H794&I794&J794=\"\",K794,IF(G794&H794&I794=\"\",J794,(IF(G794&H794=\"\",I794,IF(G794=\"\",H794,G794))))))","v":2},null,null,2,{"$nulls":4},"ミカルディス錠４０ｍｇ"]
["ミグリトールOD錠50mg「トーワ」",{"$nulls":3},1,{"$nulls":3},1,{"$nulls":3},"血糖降下薬",null,"院内採用"]
["ミコブティンカプセル１５０ｍｇ","ファイザー",null,"▲",1,{"$f":"IF(G796&H796&I796&I796&J796&K796=\"\",\"\",IF(G796&H796&I796&J796=\"\",K796,IF(G796&H796&I796=\"\",J796,(IF(G796&H796=\"\",I796,IF(G796=\"\",H796,G796))))))","v":1},{"$nulls":3},1,{"$nulls":3},"ミコブティンカプセル１５０ｍｇ","院内採用"]
["ミコンビ配合錠ＡＰ","ベーリンガー",null,"▲",6,{"$f":"IF(G797&H797&I797&I797&J797&K797=\"\",\"\",IF(G797&H797&I797&J797=\"\",K797,IF(G797&H797&I797=\"\",J797,(IF(G797&H797=\"\",I797,IF(G797=\"\",H797,G797))))))","v":6},{"$nulls":3},6,null,"データなし　テルミサルタン錠40mg1錠（同成分）+フルイトラン（同効）へ変更",null,"ミコンビ配合錠ＡＰ","院内採用"]
["ミティキュアダニ舌下錠3300",{"$nulls":3},6,{"$nulls":3},6,null,null,"特殊　簡易懸濁対象外",null,null,"院内採用"]
["ミティキュアダニ舌下錠10000",{"$nulls":3},6,{"$nulls":3},6,null,null,"特殊　簡易懸濁対象外"]
["ミニリンメルトＯＤ錠120μg","フェリングファーマ",null,"×",6,{"$f":"IF(G800&H800&I800&I800&J800&K800=\"\",\"\",IF(G800&H800&I800&J800=\"\",K800,IF(G800&H800&I800=\"\",J800,(IF(G800&H800=\"\",I800,IF(G800=\"\",H800,G800))))))","v":6},6,{"$nulls":4},"デスモプレシン点鼻液（同効）への変更　OD錠だが口腔粘膜からの吸収され薬効を発揮する部分あり　蛋白製剤なので胃酸で変性することも考えられるため水で溶解して経管チューブからよりは点鼻に剤形変更するほうがよい",null,"ミニリンメルトＯＤ錠120μg","院内採用"]
["ミニリンメルトOD錠240μg",{"$nulls":3},6,{"$nulls":3},6,null,null,"デスモプレシン点鼻液（同効）への変更　OD錠だが口腔粘膜からの吸収され薬効を発揮する部分あり　蛋白製剤なので胃酸で変性することも考えられるため水で溶解して経管チューブからよりは点鼻に剤形変更するほうがよい"]
["ミニリンメルトＯＤ錠60μg","フェリングファーマ",null,"×",6,{"$f":"IF(G802&H802&I802&I802&J802&K802=\"\",\"\",IF(G802&H802&I802&J802=\"\",K802,IF(G802&H802&I802=\"\",J802,(IF(G802&H802=\"\",I802,IF(G802=\"\",H802,G802))))))","v":6},6,{"$nulls":4},"デスモプレシン点鼻液（同効）への変更　OD錠だが口腔粘膜からの吸収され薬効を発揮する部分あり　蛋白製剤なので胃酸で変性することも考えられるため水で溶解して経管チューブからよりは点鼻に剤形変更するほうがよい",null,"ミニリンメルトＯＤ錠60μg","院内採用"]
["ミニリンメルトOD錠25mg",{"$nulls":3},6,{"$nulls":3},6,null,null,"データなし　ピトレシン（注射）・デスモプレシン（点鼻）へと変更"]
["ミニリンメルトOD錠50mg",{"$nulls":3},6,{"$nulls":3},6,null,null,"データなし　ピトレシン（注射）・デスモプレシン（点鼻）へと変更"]
["ミネブロ錠2.5mg ",{"$nulls":3},1,{"$nulls":3},1,{"$nulls":5},"院内採用"]
["ミノマイシン顆粒　２０ｍｇ",{"$nulls":3},1,{"$f":"IF(G806&H806&I806&I806&J806&K806=\"\",\"\",IF(G806&H806&I806&J806=\"\",K806,IF(G806&H806&I806=\"\",J806,(IF(G806&H806=\"\",I806,IF(G806=\"\",H806,G806))))))","v":1},null,1,{"$nulls":5},"ミノマイシン顆粒　２０ｍｇ","院内採用"]
["ミヤＢＭ細粒　５００g","ミヤリサン",null,null,1,{"$f":"IF(G807&H807&I807&I807&J807&K807=\"\",\"\",IF(G807&H807&I807&J807=\"\",K807,IF(G807&H807&I807=\"\",J807,(IF(G807&H807=\"\",I807,IF(G807=\"\",H807,G807))))))","v":1},null,null,1,null,null,"細粒のデータはないが、細粒を固めたものが錠なので流用。55℃の温湯で60分菌数変化なし。賦形剤の沈降炭酸カルシウムが溶け残る可能性あり→上清だけ注入してもよい。",null,"ミヤＢＭ細粒　５００g","院内採用"]
["ミヤＢＭ錠","ミヤリサン",null,"●",1,{"$f":"IF(G808&H808&I808&I808&J808&K808=\"\",\"\",IF(G808&H808&I808&J808=\"\",K808,IF(G808&H808&I808=\"\",J808,(IF(G808&H808=\"\",I808,IF(G808=\"\",H808,G808))))))","v":1},null,null,1,null,null,"55℃の温湯で60分菌数変化なし。賦形剤の沈降炭酸カルシウムが溶け残る可能性あり→上清だけ注入してもよい。",null,"ミヤＢＭ錠","院内採用"]
["ミラペックスＬＡ錠０．３７５ｍｇ","ベーリンガー",null,"×",6,{"$f":"IF(G809&H809&I809&I809&J809&K809=\"\",\"\",IF(G809&H809&I809&J809=\"\",K809,IF(G809&H809&I809=\"\",J809,(IF(G809&H809=\"\",I809,IF(G809=\"\",H809,G809))))))","v":6},null,null,6,null,null,"徐放性　ビ・シフロール錠（同成分）へ変更",null,"ミラペックスＬＡ錠０．３７５ｍｇ","院内採用"]
["ミラペックスＬＡ錠１．５ｍｇ","ベーリンガー",null,"×",6,{"$f":"IF(G810&H810&I810&I810&J810&K810=\"\",\"\",IF(G810&H810&I810&J810=\"\",K810,IF(G810&H810&I810=\"\",J810,(IF(G810&H810=\"\",I810,IF(G810=\"\",H810,G810))))))","v":6},null,null,6,null,null,"徐放性　ビ・シフロール錠（同成分）へ変更",null,"ミラペックスＬＡ錠１．５ｍｇ"]
["ミルタザピン錠15mg「明治」",{"$nulls":3},1,null,null,1,{"$nulls":6},"院内採用"]
["ムコスタ顆粒２０％　０．５g",{"$nulls":3},1,{"$f":"IF(G812&H812&I812&I812&J812&K812=\"\",\"\",IF(G812&H812&I812&J812=\"\",K812,IF(G812&H812&I812=\"\",J812,(IF(G812&H812=\"\",I812,IF(G812=\"\",H812,G812))))))","v":1},null,1,{"$nulls":5},"ムコスタ顆粒２０％　０．５g"]
["ムコダインＤＳ　５０％　１００g","杏林",null,null,1,{"$f":"IF(G813&H813&I813&I813&J813&K813=\"\",\"\",IF(G813&H813&I813&J813=\"\",K813,IF(G813&H813&I813=\"\",J813,(IF(G813&H813=\"\",I813,IF(G813=\"\",H813,G813))))))","v":1},null,null,1,{"$nulls":4},"ムコダインＤＳ　５０％　１００g"]
["ムンデシンカプセル100mg",{"$nulls":3},6,{"$nulls":3},6,null,null,"データなし　　抗がん剤　代用薬ないため主治医判断　脱Cpした後の安定性は検討中とのこと","単独投与　投与器具は毎回破棄　曝露に注意"]
["メイアクトＭＳ小児用細粒　１００ｍｇ",{"$nulls":3},1,{"$f":"IF(G815&H815&I815&I815&J815&K815=\"\",\"\",IF(G815&H815&I815&J815=\"\",K815,IF(G815&H815&I815=\"\",J815,(IF(G815&H815=\"\",I815,IF(G815=\"\",H815,G815))))))","v":1},null,1,{"$nulls":5},"メイアクトＭＳ小児用細粒　１００ｍｇ","院内採用"]
["メイラックス錠１ｍｇ",null,null,"●",1,{"$f":"IF(G816&H816&I816&I816&J816&K816=\"\",\"\",IF(G816&H816&I816&J816=\"\",K816,IF(G816&H816&I816=\"\",J816,(IF(G816&H816=\"\",I816,IF(G816=\"\",H816,G816))))))","v":1},null,1,{"$nulls":5},"メイラックス錠１ｍｇ","院内採用"]
["メインテート錠０．６２５ｍｇ","田辺三菱",null,"●",2,{"$f":"IF(G817&H817&I817&I817&J817&K817=\"\",\"\",IF(G817&H817&I817&J817=\"\",K817,IF(G817&H817&I817=\"\",J817,(IF(G817&H817=\"\",I817,IF(G817=\"\",H817,G817))))))","v":2},null,null,2,{"$nulls":4},"メインテート錠０．６２５ｍｇ"]
["メインテート錠２．５ｍｇ　",null,null,"●",2,{"$f":"IF(G818&H818&I818&I818&J818&K818=\"\",\"\",IF(G818&H818&I818&J818=\"\",K818,IF(G818&H818&I818=\"\",J818,(IF(G818&H818=\"\",I818,IF(G818=\"\",H818,G818))))))","v":2},2,null,6,null,2,"割線ありの製剤へ変更されてからのデータでは簡易懸濁不適。他院DBでは温湯の量を増やすor放置時間を長くすることで対応。実験の結果OK。",null,"メインテート錠２．５ｍｇ　"]
["メキシチールカプセル５０ｍｇ　",null,null,"●",1,{"$f":"IF(G819&H819&I819&I819&J819&K819=\"\",\"\",IF(G819&H819&I819&J819=\"\",K819,IF(G819&H819&I819=\"\",J819,(IF(G819&H819=\"\",I819,IF(G819=\"\",H819,G819))))))","v":1},null,1,{"$nulls":5},"メキシチールカプセル５０ｍｇ　","院内採用"]
["メキニスト錠2mg",{"$nulls":3},6,{"$nulls":3},6,null,null,"抗がん剤 代用薬ないため主治医判断　データなし","単独投与　投与器具は毎回破棄　曝露に注意"]
["メキニスト錠0.5mg",{"$nulls":3},6,{"$nulls":3},6,null,null,"抗がん剤 代用薬ないため主治医判断　データなし","単独投与　投与器具は毎回破棄　曝露に注意"]
["メサラジン錠500mg「サワイ」",{"$nulls":3},6,{"$nulls":3},6,null,null,"250mｇ参照　多孔性皮膜コーティング顆粒錠（徐放性）　ペンタサ坐剤（同成分）・ペンタサ注腸（同成分）はあるが内服の代用薬ないため主治医判断",null,null,"院内採用"]
["メジコン散　１０％",{"$nulls":3},1,{"$f":"IF(G823&H823&I823&I823&J823&K823=\"\",\"\",IF(G823&H823&I823&J823=\"\",K823,IF(G823&H823&I823=\"\",J823,(IF(G823&H823=\"\",I823,IF(G823=\"\",H823,G823))))))","v":1},null,1,{"$nulls":5},"メジコン散　１０％"]
["メジコン錠　１５ｍｇ",null,null,"●",1,1,null,1,{"$nulls":5},"メジコン錠　１５ｍｇ"]
["メスチノン錠　６０ｍｇ",null,null,"▲",1,1,null,1,{"$nulls":5},"メスチノン錠　６０ｍｇ","院内採用"]
["メソトレキセート錠２．５ｍｇ",null,null,"×",6,6,null,6,{"$nulls":3},"データなし　抗がん剤　代用薬ないため主治医判断単独投与","単独投与　投与器具は毎回破棄　曝露に注意","メソトレキセート錠２．５ｍｇ","院内採用"]
["メタルカプタ－ゼカプセル２００ｍｇ",null,null,"▲",1,1,null,1,{"$nulls":3},"100mｇ参照",null,"メタルカプタ－ゼカプセル２００ｍｇ","院内採用"]
["メチコバール錠５００μg",null,null,"●",1,1,null,1,{"$nulls":5},"メチコバール錠５００μg","院内採用"]
["メチルエルゴメトリン錠　０．１２５ｍｇ「あすか」　","あすか",null,"▲",1,1,null,1,{"$nulls":5},"メチルエルゴメトリン錠　０．１２５ｍｇ「あすか」　","院内採用"]
["メチルジゴキシン錠0.1mg「タイヨー」",{"$nulls":3},1,{"$nulls":3},1,{"$nulls":5},"院内採用"]
["メトグルコ錠　２５０ｍｇ","大日本住友",null,"●",1,{"$f":"IF(G831&H831&I831&I831&J831&K831=\"\",\"\",IF(G831&H831&I831&J831=\"\",K831,IF(G831&H831&I831=\"\",J831,(IF(G831&H831=\"\",I831,IF(G831=\"\",H831,G831))))))","v":1},{"$nulls":3},1,null,null,"血糖降下薬","メトグルコ錠　２５０ｍｇ","院内採用"]
["メトクロプラミド錠5mg「トーワ」",{"$nulls":3},1,{"$nulls":3},1,{"$nulls":5},"院内採用"]
["メトリジン錠２ｍｇ",null,null,"●",1,{"$f":"IF(G833&H833&I833&I833&J833&K833=\"\",\"\",IF(G833&H833&I833&J833=\"\",K833,IF(G833&H833&I833=\"\",J833,(IF(G833&H833=\"\",I833,IF(G833=\"\",H833,G833))))))","v":1},null,1,{"$nulls":5},"メトリジン錠２ｍｇ","院内採用"]
["メトレート錠２ｍｇ","参天",null,"×",4,1,null,1,{"$nulls":4},"単独投与　投与器具は毎回破棄　曝露に注意","メトレート錠２ｍｇ","院内採用"]
["メドロール錠　４ｍｇ",null,null,"▲",1,1,null,1,{"$nulls":5},"メドロール錠　４ｍｇ","院内採用"]
["メネシット配合錠１００",null,null,"●",1,1,null,1,{"$nulls":3},"ドパミン製剤のため酸化マグネシウム、鉄剤（フェネルミン等）と同時懸濁しない",0,"メネシット配合錠１００","院内採用"]
["メプチンドライシロップ0.005%","大塚製薬",null,null,1,1,1,{"$nulls":4},"メプチン錠は懸濁可/簡易懸濁データなし","単独投与　常温の水で懸濁","メプチンドライシロップ0.005%","院内採用"]
["メプチン錠５０μg",null,null,"▲",1,1,null,1,{"$nulls":5},"メプチン錠５０μg","院内採用"]
["メマリーＯＤ錠20ｍｇ","第一三共",null,"▲",1,1,null,null,1,null,null,"55℃以上は凝集物質が生成","常温の水で懸濁","メマリーＯＤ錠20ｍｇ","院内採用"]
["メマンチン塩酸塩OD錠10mg「明治」",{"$nulls":3},1,{"$nulls":3},1]
["メリスロン錠　６ｍｇ",null,null,"●",1,{"$f":"IF(G841&H841&I841&I841&J841&K841=\"\",\"\",IF(G841&H841&I841&J841=\"\",K841,IF(G841&H841&I841=\"\",J841,(IF(G841&H841=\"\",I841,IF(G841=\"\",H841,G841))))))","v":1},null,1,{"$nulls":5},"メリスロン錠　６ｍｇ"]
["メルカゾール錠　５ｍｇ",null,null,"●",6,{"$f":"IF(G842&H842&I842&I842&J842&K842=\"\",\"\",IF(G842&H842&I842&J842=\"\",K842,IF(G842&H842&I842=\"\",J842,(IF(G842&H842=\"\",I842,IF(G842=\"\",H842,G842))))))","v":6},null,6,{"$nulls":3},"データなし　錠剤粉砕可",null,"メルカゾール錠　５ｍｇ","院内採用"]
["メンドン７．５ｍｇ",null,null,"▲",1,{"$f":"IF(G843&H843&I843&I843&J843&K843=\"\",\"\",IF(G843&H843&I843&J843=\"\",K843,IF(G843&H843&I843=\"\",J843,(IF(G843&H843=\"\",I843,IF(G843=\"\",H843,G843))))))","v":1},null,1,{"$nulls":5},"メンドン７．５ｍｇ","院内採用"]
["モサプリドクエン酸塩錠5ｍｇ「日医工」",null,null,"●",1,{"$f":"IF(G844&H844&I844&I844&J844&K844=\"\",\"\",IF(G844&H844&I844&J844=\"\",K844,IF(G844&H844&I844=\"\",J844,(IF(G844&H844=\"\",I844,IF(G844=\"\",H844,G844))))))","v":1},null,1,{"$nulls":5},"モサプリドクエン酸塩錠5ｍｇ「日医工」","院内採用"]
["モ－ビック錠１０ｍｇ","ベーリンガー",null,"▲",1,{"$f":"IF(G845&H845&I845&I845&J845&K845=\"\",\"\",IF(G845&H845&I845&J845=\"\",K845,IF(G845&H845&I845=\"\",J845,(IF(G845&H845=\"\",I845,IF(G845=\"\",H845,G845))))))","v":1},{"$nulls":3},1,{"$nulls":3},"モ－ビック錠１０ｍｇ"]
["モンテルカストOD錠１０ｍｇ｢明治｣",null,null,"▲",1,{"$nulls":3},1,{"$nulls":5},"院内採用"]
["モンテルカスト細粒4mg「明治」",{"$nulls":3},1,{"$nulls":3},1,{"$nulls":5},"院内採用"]
["モンテルカストチュアブル錠5mg「ｻﾜｲ」",{"$nulls":3},1,{"$nulls":3},1,null,null,"沈殿しやすいが懸濁する。多めの水で洗い流す。",null,null,"院内採用"]
["ヤーズフレックス配合錠",{"$nulls":3},6,{"$nulls":3},6,null,null,"データなし　代用薬ないため主治医判断"]
["薬用炭",{"$nulls":3},6,{"$f":"IF(G850&H850&I850&I850&J850&K850=\"\",\"\",IF(G850&H850&I850&J850=\"\",K850,IF(G850&H850&I850=\"\",J850,(IF(G850&H850=\"\",I850,IF(G850=\"\",H850,G850))))))","v":6},6,{"$nulls":4},"データなし　水で投与",null,"薬用炭","院内採用"]
["ユーエフティE配合顆粒T200",{"$nulls":3},6,{"$nulls":3},6,null,null,"データなし　抗がん剤 代用薬ないため主治医判断","単独投与　投与器具は毎回破棄　曝露に注意"]
["ユーエフティカプセル１００ｍｇ","大鵬薬品",null,"×",4,{"$f":"IF(G852&H852&I852&I852&J852&K852=\"\",\"\",IF(G852&H852&I852&J852=\"\",K852,IF(G852&H852&I852=\"\",J852,(IF(G852&H852=\"\",I852,IF(G852=\"\",H852,G852))))))","v":1},null,null,1,null,null,"抗がん剤","単独投与　投与器具は毎回破棄　曝露に注意","ユーエフティカプセル１００ｍｇ","院内採用"]
["ユーゼル錠２５ｍｇ","大鵬",null,"▲",1,1,null,1,{"$nulls":5},"ユーゼル錠２５ｍｇ"]
["ユーロジン１ｍｇ錠",null,null,"●",1,1,null,1,{"$nulls":5},"ユーロジン１ｍｇ錠","院内採用"]
["ユナシン細粒小児用　１００ｍｇ",{"$nulls":3},6,6,null,6,{"$nulls":3},"最小通過は18Fr.　ユナシン錠（同成分）へ変更",null,"ユナシン細粒小児用　１００ｍｇ","院内採用"]
["ユナシン錠　３７５ｍｇ",null,null,"▲",1,1,null,1,{"$nulls":5},"ユナシン錠　３７５ｍｇ","院内採用"]
["ユニフィルＬＡ錠２００ｍｇ",null,null,"▲",6,6,null,6,{"$nulls":3},"徐放性　主治医と相談。",null,"ユニフィルＬＡ錠２００ｍｇ","院内採用"]
["ユビデカレノン錠10mg「サワイ」",{"$nulls":3},1,{"$nulls":3},1,{"$nulls":5},"院内採用"]
["ユベラＮカプセル　１００ｍｇ",null,null,"●",1,{"$f":"IF(G859&H859&I859&I859&J859&K859=\"\",\"\",IF(G859&H859&I859&J859=\"\",K859,IF(G859&H859&I859=\"\",J859,(IF(G859&H859=\"\",I859,IF(G859=\"\",H859,G859))))))","v":1},null,1,{"$nulls":5},"ユベラＮカプセル　１００ｍｇ"]
["ユリーフOD錠4mg",{"$nulls":3},1,{"$nulls":3},1]
["ユリーフ錠４ｍｇ",null,null,"●",1,{"$f":"IF(G861&H861&I861&I861&J861&K861=\"\",\"\",IF(G861&H861&I861&J861=\"\",K861,IF(G861&H861&I861=\"\",J861,(IF(G861&H861=\"\",I861,IF(G861=\"\",H861,G861))))))","v":1},null,1,{"$nulls":5},"ユリーフ錠４ｍｇ"]
["ユリノーム錠５０ｍｇ　",null,null,"●",1,{"$f":"IF(G862&H862&I862&I862&J862&K862=\"\",\"\",IF(G862&H862&I862&J862=\"\",K862,IF(G862&H862&I862=\"\",J862,(IF(G862&H862=\"\",I862,IF(G862=\"\",H862,G862))))))","v":1},null,1,{"$nulls":5},"ユリノーム錠５０ｍｇ　","院内採用"]
["ヨウ化カリウム「日医工」",{"$nulls":3},1,{"$f":"IF(G863&H863&I863&I863&J863&K863=\"\",\"\",IF(G863&H863&I863&J863=\"\",K863,IF(G863&H863&I863=\"\",J863,(IF(G863&H863=\"\",I863,IF(G863=\"\",H863,G863))))))","v":1},null,1,{"$nulls":5},"ヨウ化カリウム「日医工」","院内採用"]
["ラグノスNF経口ゼリー分包12g",{"$nulls":3},1,{"$nulls":3},1,{"$nulls":5},"院内採用"]
["ラシックス２０ｍｇ錠",null,null,"●",1,{"$f":"IF(G865&H865&I865&I865&J865&K865=\"\",\"\",IF(G865&H865&I865&J865=\"\",K865,IF(G865&H865&I865=\"\",J865,(IF(G865&H865=\"\",I865,IF(G865=\"\",H865,G865))))))","v":1},null,1,{"$nulls":5},"ラシックス２０ｍｇ錠"]
["ラジレス錠１５０ｍｇ","ノバルティス",null,"×",6,6,{"$nulls":3},6,null,"データなし　代替薬なし主治医と相談",null,"ラジレス錠１５０ｍｇ"]
["ラックビ－Ｒ（シール）１g",{"$nulls":3},1,1,null,1,{"$nulls":3},"温湯による生菌数低下の可能性あり","常温の水で懸濁","ラックビ－Ｒ（シール）１g","院内採用"]
["ラックビー微粒Ｎ　１％　1gX1008包","興和創薬",null,null,1,1,1,null,6,null,null,"温湯による生菌数低下の可能性あり","常温の水で懸濁","ラックビー微粒Ｎ　１％　1gX1008包"]
["ラニラピッド錠　０．１ｍｇ",null,null,"●",1,1,null,1,{"$nulls":5},"ラニラピッド錠　０．１ｍｇ"]
["ラフチジン錠10ｍｇ「日医工」","日医工",null,"●",1,1,null,1,{"$nulls":5},"ラフチジン錠10ｍｇ「日医工」","院内採用"]
["ラベキュアパック４００","エーザイ",null,"×",6,6,6,{"$nulls":4},"データなし　特殊→アモキシシリン（同成分）、クラリシッド（同成分）、ランソプラゾールOD錠（同効）またはオメプラゾール注（同効）へ変更",null,"ラベキュアパック４００"]
["ラベプラゾールNa塩錠10ｍｇ「明治」","Ｍｅｉｊｉ",null,"●",6,6,null,6,{"$nulls":3},"胃酸で失活するため腸溶性　腸からであればOK　ランソプラゾール（同効薬）へ変更",null,"ラベプラゾールNa塩錠10ｍｇ「明治」","院内採用"]
["ラボナ錠50mg",{"$nulls":3},4,1,null,1,{"$nulls":6},"院内採用"]
["ラミクタール錠１００ｍｇ　","グラクソ",null,"▲",1,1,null,1,1,{"$nulls":4},"ラミクタール錠１００ｍｇ　","院内採用"]
["ラミクタール錠２５ｍｇ　","グラクソ",null,"▲",1,1,null,1,1,{"$nulls":4},"ラミクタール錠２５ｍｇ　","院内採用"]
["ラミクタール錠小児用２ｍｇ　","グラクソ",null,"▲",1,1,null,1,1,{"$nulls":4},"ラミクタール錠小児用２ｍｇ　"]
["ラミクタール錠小児用５ｍｇ　","グラクソ",null,"▲",1,1,null,1,1,{"$nulls":4},"ラミクタール錠小児用５ｍｇ　","院内採用"]
["ランソプラゾールOD錠15ｍｇ「トーワ」",null,null,"●",1,1,null,1,{"$nulls":3},"温湯でタラコ状に固まる→常温の水で懸濁可能としているが、詰まる場合はタケキャブへ変更を主治医と相談する。","常温の水で懸濁","ランソプラゾールOD錠15ｍｇ「トーワ」","院内採用"]
["リアルダ錠1200mg",{"$nulls":3},6,{"$nulls":3},6,null,null,"大腸にて持続放出するDDS製剤。薬剤内の親水性基剤がゲル化するためチューブ閉塞の可能性あり。主治医と要相談。",null,null,"院内採用"]
["リーゼ錠５ｍｇ",null,null,"●",1,{"$f":"IF(G880&H880&I880&I880&J880&K880=\"\",\"\",IF(G880&H880&I880&J880=\"\",K880,IF(G880&H880&I880=\"\",J880,(IF(G880&H880=\"\",I880,IF(G880=\"\",H880,G880))))))","v":1},null,1,{"$nulls":5},"リーゼ錠５ｍｇ","院内採用"]
["リーマス錠２００ｍｇ",null,null,"▲",2,{"$f":"IF(G881&H881&I881&I881&J881&K881=\"\",\"\",IF(G881&H881&I881&J881=\"\",K881,IF(G881&H881&I881=\"\",J881,(IF(G881&H881=\"\",I881,IF(G881=\"\",H881,G881))))))","v":2},null,2,{"$nulls":5},"リーマス錠２００ｍｇ","院内採用"]
["リオナ錠250mg",{"$nulls":3},1,{"$nulls":3},1,{"$nulls":5},"院内採用"]
["リオレサール錠５ｍｇ",null,null,"●",1,{"$f":"IF(G883&H883&I883&I883&J883&K883=\"\",\"\",IF(G883&H883&I883&J883=\"\",K883,IF(G883&H883&I883=\"\",J883,(IF(G883&H883=\"\",I883,IF(G883=\"\",H883,G883))))))","v":1},null,1,{"$nulls":5},"リオレサール錠５ｍｇ","院内採用"]
["リクシアナOD錠60mg",{"$nulls":3},1,{"$nulls":3},1,{"$nulls":5},"院内採用"]
["リクシアナ錠60ｍｇ","第一三共",null,"●",1,{"$f":"IF(G885&H885&I885&I885&J885&K885=\"\",\"\",IF(G885&H885&I885&J885=\"\",K885,IF(G885&H885&I885=\"\",J885,(IF(G885&H885=\"\",I885,IF(G885=\"\",H885,G885))))))","v":1},null,null,1,{"$nulls":4},"リクシアナ錠60ｍｇ"]
["リザベンカプセル１００ｍｇ",null,null,"▲",1,{"$f":"IF(G886&H886&I886&I886&J886&K886=\"\",\"\",IF(G886&H886&I886&J886=\"\",K886,IF(G886&H886&I886=\"\",J886,(IF(G886&H886=\"\",I886,IF(G886=\"\",H886,G886))))))","v":1},null,1,{"$nulls":5},"リザベンカプセル１００ｍｇ","院内採用"]
["リスパダ－ル錠１ｍｇ",null,null,"●",1,{"$f":"IF(G887&H887&I887&I887&J887&K887=\"\",\"\",IF(G887&H887&I887&J887=\"\",K887,IF(G887&H887&I887=\"\",J887,(IF(G887&H887=\"\",I887,IF(G887=\"\",H887,G887))))))","v":1},null,1,{"$nulls":5},"リスパダ－ル錠１ｍｇ"]
["リスペリドンOD錠１mg「タカタ」",{"$nulls":3},1,{"$nulls":3},1,{"$nulls":5},"院内採用"]
["リスミー錠１ｍｇ",null,null,"●",1,{"$f":"IF(G889&H889&I889&I889&J889&K889=\"\",\"\",IF(G889&H889&I889&J889=\"\",K889,IF(G889&H889&I889=\"\",J889,(IF(G889&H889=\"\",I889,IF(G889=\"\",H889,G889))))))","v":1},null,1,{"$nulls":5},"リスミー錠１ｍｇ"]
["リズミック錠１０ｍｇ",null,null,"●",1,{"$f":"IF(G890&H890&I890&I890&J890&K890=\"\",\"\",IF(G890&H890&I890&J890=\"\",K890,IF(G890&H890&I890=\"\",J890,(IF(G890&H890=\"\",I890,IF(G890=\"\",H890,G890))))))","v":1},null,1,{"$nulls":5},"リズミック錠１０ｍｇ","院内採用"]
["リネゾリド錠600mg",{"$nulls":3},4,{"$nulls":3},4,{"$nulls":5},"院内採用"]
["リ－バクト配合顆粒　４．１５g",{"$nulls":3},6,{"$f":"IF(G892&H892&I892&I892&J892&K892=\"\",\"\",IF(G892&H892&I892&J892=\"\",K892,IF(G892&H892&I892=\"\",J892,(IF(G892&H892=\"\",I892,IF(G892=\"\",H892,G892))))))","v":6},null,6,6,null,null,"データなし　BCAAは溶けにくいのでチューブが詰まる　熱には安定　他院で1包を80℃100mLにいれて2～3分激しく振り混ぜて冷ましてから投与する方法あり　主治医と相談",null,"リ－バクト配合顆粒　４．１５g"]
["リパクレオンカプセル１５０ｍｇ","アボット",null,"●",6,{"$f":"IF(G893&H893&I893&I893&J893&K893=\"\",\"\",IF(G893&H893&I893&J893=\"\",K893,IF(G893&H893&I893=\"\",J893,(IF(G893&H893=\"\",I893,IF(G893=\"\",H893,G893))))))","v":6},null,null,6,null,null,"胃内で失活　脱カプセルした顆粒は16Fr.通過するので16Fr.以上の太さのチューブで腸からの投与であれば投与可能と思われる（メーカーは推奨せず）　上記の条件以外であれば代用薬ないため主治医判断",null,"リパクレオンカプセル１５０ｍｇ","院内採用"]
["リバロ錠２ｍｇ","興和",null,"●",1,{"$f":"IF(G894&H894&I894&I894&J894&K894=\"\",\"\",IF(G894&H894&I894&J894=\"\",K894,IF(G894&H894&I894=\"\",J894,(IF(G894&H894=\"\",I894,IF(G894=\"\",H894,G894))))))","v":1},null,null,1,null,null,"光に不安定なので懸濁後30分以内に注入",null,"リバロ錠２ｍｇ"]
["リファジンカプセル　１５０ｍｇ","第一三共",null,"●",1,{"$f":"IF(G895&H895&I895&I895&J895&K895=\"\",\"\",IF(G895&H895&I895&J895=\"\",K895,IF(G895&H895&I895=\"\",J895,(IF(G895&H895=\"\",I895,IF(G895=\"\",H895,G895))))))","v":1},null,null,1,null,null,"カプセルの一部がシリンジ付着するが通過には問題なし",null,"リファジンカプセル　１５０ｍｇ"]
["リファンピシンカプセル150mg「サンド」",{"$nulls":3},1,null,null,1,{"$nulls":6},"院内採用"]
["リフキシマ錠200mg",{"$nulls":3},1,{"$nulls":3},1,null,null,"しっかり混和させることで8Fr.通過可能","しっかり混和する",null,"院内採用"]
["リフレックス錠１５ｍｇ","Ｍｅｉｊｉ",null,"▲",1,{"$f":"IF(G898&H898&I898&I898&J898&K898=\"\",\"\",IF(G898&H898&I898&J898=\"\",K898,IF(G898&H898&I898=\"\",J898,(IF(G898&H898=\"\",I898,IF(G898=\"\",H898,G898))))))","v":1},null,null,1,{"$nulls":4},"リフレックス錠１５ｍｇ"]
["リボトリール細粒　０．１％",{"$nulls":3},1,{"$f":"IF(G899&H899&I899&I899&J899&K899=\"\",\"\",IF(G899&H899&I899&J899=\"\",K899,IF(G899&H899&I899=\"\",J899,(IF(G899&H899=\"\",I899,IF(G899=\"\",H899,G899))))))","v":1},null,1,{"$nulls":3},"多めの水でフラッシュ",null,"リボトリール細粒　０．１％","院内採用"]
["リボトリール錠０．５ｍｇ",null,null,"●",1,{"$f":"IF(G900&H900&I900&I900&J900&K900=\"\",\"\",IF(G900&H900&I900&J900=\"\",K900,IF(G900&H900&I900=\"\",J900,(IF(G900&H900=\"\",I900,IF(G900=\"\",H900,G900))))))","v":1},null,1,{"$nulls":5},"リボトリール錠０．５ｍｇ","院内採用"]
["リマチル　１００ｍｇ",null,null,"▲",6,{"$f":"IF(G901&H901&I901&I901&J901&K901=\"\",\"\",IF(G901&H901&I901&J901=\"\",K901,IF(G901&H901&I901=\"\",J901,(IF(G901&H901=\"\",I901,IF(G901=\"\",H901,G901))))))","v":6},null,6,{"$nulls":3},"吸湿性　錠剤粉砕可",null,"リマチル　１００ｍｇ"]
["リマプロストアルファデクス錠５μg「F」","富士製薬",null,"×",4,{"$f":"IF(G902&H902&I902&I902&J902&K902=\"\",\"\",IF(G902&H902&I902&J902=\"\",K902,IF(G902&H902&I902=\"\",J902,(IF(G902&H902=\"\",I902,IF(G902=\"\",H902,G902))))))","v":1},null,1,{"$nulls":5},"リマプロストアルファデクス錠５μg「F」","院内採用"]
["リムパーザ錠150mg",{"$nulls":3},6,{"$nulls":3},6,null,null,"データなし　抗がん剤　代用薬なし主治医と相談"]
["リムパーザ錠100mg",{"$nulls":3},6,{"$nulls":3},6,null,null,"データなし　抗がん剤　代用薬なし主治医と相談"]
["硫酸アトロピン","ファイザー",null,null,1,{"$f":"IF(G905&H905&I905&I905&J905&K905=\"\",\"\",IF(G905&H905&I905&J905=\"\",K905,IF(G905&H905&I905=\"\",J905,(IF(G905&H905=\"\",I905,IF(G905=\"\",H905,G905))))))","v":1},1,{"$nulls":5},"単独投与　常温の水で懸濁","硫酸アトロピン"]
["リリカOD錠25mg",{"$nulls":3},1,{"$nulls":3},1,{"$nulls":5},"院内採用"]
["リリカOD錠75mg",{"$nulls":3},1,{"$nulls":3},1,{"$nulls":5},"院内採用"]
["リリカカプセル２５ｍｇ　","ファイザー",null,"●",1,{"$f":"IF(G908&H908&I908&I908&J908&K908=\"\",\"\",IF(G908&H908&I908&J908=\"\",K908,IF(G908&H908&I908=\"\",J908,(IF(G908&H908=\"\",I908,IF(G908=\"\",H908,G908))))))","v":1},null,null,1,null,null,"150mｇのデータ参照",null,"リリカカプセル２５ｍｇ　"]
["リリカカプセル７５ｍｇ","ファイザー",null,"●",1,{"$f":"IF(G909&H909&I909&I909&J909&K909=\"\",\"\",IF(G909&H909&I909&J909=\"\",K909,IF(G909&H909&I909=\"\",J909,(IF(G909&H909=\"\",I909,IF(G909=\"\",H909,G909))))))","v":1},null,null,1,null,null,"150mｇのデータ参照",null,"リリカカプセル７５ｍｇ"]
["リルゾール錠　50mg",{"$nulls":3},1,{"$nulls":3},1,{"$nulls":5},"院内採用"]
["リルテック錠　５０ｍｇ",null,null,"▲",2,{"$f":"IF(G911&H911&I911&I911&J911&K911=\"\",\"\",IF(G911&H911&I911&J911=\"\",K911,IF(G911&H911&I911=\"\",J911,(IF(G911&H911=\"\",I911,IF(G911=\"\",H911,G911))))))","v":2},null,2,{"$nulls":5},"リルテック錠　５０ｍｇ"]
["リンゼス錠",{"$nulls":3},6,{"$nulls":3},6,null,null,"吸湿性あり懸濁不可　酸化マグネシウムやアミティーザなど同系統「腸管への水分分泌系薬剤」への変更考慮"]
["リンデロン散　０．１％",{"$nulls":3},1,{"$f":"IF(G913&H913&I913&I913&J913&K913=\"\",\"\",IF(G913&H913&I913&J913=\"\",K913,IF(G913&H913&I913=\"\",J913,(IF(G913&H913=\"\",I913,IF(G913=\"\",H913,G913))))))","v":1},null,1,{"$nulls":5},"リンデロン散　０．１％","院内採用"]
["リンデロン錠　０．５ｍｇ",null,null,"●",1,1,null,1,{"$nulls":5},"リンデロン錠　０．５ｍｇ"]
["ルーラン錠４ｍｇ",null,null,"▲",1,1,null,1,{"$nulls":5},"ルーラン錠４ｍｇ"]
["ルジオミール錠１０ｍｇ",null,null,"▲",1,1,null,1,{"$nulls":5},"ルジオミール錠１０ｍｇ"]
["ルセフィ錠2.5ｍｇ","大正富山",null,"▲",1,1,null,null,1,{"$nulls":3},"血糖降下薬","ルセフィ錠2.5ｍｇ"]
["ルネスタ錠1ｍｇ","エーザイ",null,"●",6,6,null,6,{"$nulls":3},"類縁物質増加　錠剤粉砕可",null,"ルネスタ錠1ｍｇ","院内採用"]
["ルネスタ錠2mg",{"$nulls":3},6,{"$nulls":3},6,null,null,"類縁物質増加　錠剤粉砕可"]
["ルパフィン錠10mg",{"$nulls":3},1,{"$nulls":3},1]
["ルプラック錠４ｍｇ",null,null,"●",1,{"$f":"IF(G921&H921&I921&I921&J921&K921=\"\",\"\",IF(G921&H921&I921&J921=\"\",K921,IF(G921&H921&I921=\"\",J921,(IF(G921&H921=\"\",I921,IF(G921=\"\",H921,G921))))))","v":1},null,1,{"$nulls":3},"8mｇ参照",null,"ルプラック錠４ｍｇ"]
["ルボックス錠　２５ｍｇ",null,null,"●",2,2,null,2,{"$nulls":5},"ルボックス錠　２５ｍｇ","院内採用"]
["ルリッド錠１５０",null,null,"▲",1,1,null,1,{"$nulls":5},"ルリッド錠１５０","院内採用"]
["レイアタッツカプセル１５０ｍｇ","ブリストルマイヤーズ",null,"×",4,1,null,1,{"$nulls":3},"HIV",null,"レイアタッツカプセル１５０ｍｇ","院内採用"]
["レキップＣＲ錠２ｍｇ","グラクソ",null,"▲",6,6,null,null,6,null,null,"徐放性　レキップ錠（同成分）への変更",null,"レキップＣＲ錠２ｍｇ","院内採用"]
["レキップ錠０．２５ｍｇ","グラクソ",null,"▲",1,1,null,1,1,{"$nulls":4},"レキップ錠０．２５ｍｇ"]
["レキップ錠１ｍｇ","グラクソ",null,"▲",1,1,null,1,1,{"$nulls":4},"レキップ錠１ｍｇ"]
["レキップ錠ＣＲ8ｍｇ","グラクソ",null,"▲",6,6,null,null,6,null,null,"徐放性　レキップ錠（同成分）への変更",null,"レキップ錠ＣＲ8ｍｇ","院内採用"]
["レクサプロ錠１０ｍｇ","田辺三菱","持田製薬","▲",1,1,null,null,1,{"$nulls":4},"レクサプロ錠１０ｍｇ","院内採用"]
["レクシヴァ錠７００","ヴィーブ",null,"×",3,2,null,2,{"$nulls":3},"HIV",null,"レクシヴァ錠７００"]
["レクチゾール錠２５ｍｇ",null,null,"▲",1,1,null,1,{"$nulls":5},"レクチゾール錠２５ｍｇ","院内採用"]
["レグパラ錠25ｍｇ","協和発酵キリン",null,"●",1,1,null,null,1,{"$nulls":4},"レグパラ錠25ｍｇ"]
["レスタミンコーワ錠　１０ｍｇ",null,null,"▲",2,2,null,2,{"$nulls":5},"レスタミンコーワ錠　１０ｍｇ","院内採用"]
["レダマイシンカプセル　１５０ｍｇ",null,null,"▲",1,1,null,1,{"$nulls":5},"レダマイシンカプセル　１５０ｍｇ","院内採用"]
["レトロゾール錠2.5mg",{"$nulls":3},4,{"$nulls":3},4,{"$nulls":3},"単独投与　投与器具は毎回破棄　曝露に注意",null,"院内採用"]
["レトロビルカプセル　１００ｍｇ",null,null,"×",4,{"$f":"IF(G936&H936&I936&I936&J936&K936=\"\",\"\",IF(G936&H936&I936&J936=\"\",K936,IF(G936&H936&I936=\"\",J936,(IF(G936&H936=\"\",I936,IF(G936=\"\",H936,G936))))))","v":1},null,1,{"$nulls":3},"HIV",null,"レトロビルカプセル　１００ｍｇ","院内採用"]
["レナデックス錠　４ｍｇ","セルジーン",null,"▲",1,{"$f":"IF(G937&H937&I937&I937&J937&K937=\"\",\"\",IF(G937&H937&I937&J937=\"\",K937,IF(G937&H937&I937=\"\",J937,(IF(G937&H937=\"\",I937,IF(G937=\"\",H937,G937))))))","v":1},{"$nulls":3},1,{"$nulls":3},"レナデックス錠　４ｍｇ","院内採用"]
["レバチオ錠２０ｍｇ","ファイザー",null,"▲",1,{"$f":"IF(G938&H938&I938&I938&J938&K938=\"\",\"\",IF(G938&H938&I938&J938=\"\",K938,IF(G938&H938&I938=\"\",J938,(IF(G938&H938=\"\",I938,IF(G938=\"\",H938,G938))))))","v":1},null,null,1,null,null,"120mlのフラッシュ必要",null,"レバチオ錠２０ｍｇ","院内採用"]
["レバミピド錠100ｍｇ「オーツカ」","ＥＭＥ2","大原","●",1,{"$f":"IF(G939&H939&I939&I939&J939&K939=\"\",\"\",IF(G939&H939&I939&J939=\"\",K939,IF(G939&H939&I939=\"\",J939,(IF(G939&H939=\"\",I939,IF(G939=\"\",H939,G939))))))","v":1},null,1,1,{"$nulls":4},"レバミピド錠100ｍｇ「EMEC」","院内採用"]
["レバミピド錠100ｍｇ「オーツカ」",{"$nulls":3},1,{"$nulls":3},1,{"$nulls":5},"院内採用"]
["レフト－ゼ錠（５０ｍｇ）",null,null,"▲",2,{"$f":"IF(G941&H941&I941&I941&J941&K941=\"\",\"\",IF(G941&H941&I941&J941=\"\",K941,IF(G941&H941&I941=\"\",J941,(IF(G941&H941=\"\",I941,IF(G941=\"\",H941,G941))))))","v":2},null,2,{"$nulls":5},"レフト－ゼ錠（５０ｍｇ）"]
["レブラミドカプセル　５ｍｇ","セルジーン",null,"×",4,{"$f":"IF(G942&H942&I942&I942&J942&K942=\"\",\"\",IF(G942&H942&I942&J942=\"\",K942,IF(G942&H942&I942=\"\",J942,(IF(G942&H942=\"\",I942,IF(G942=\"\",H942,G942))))))","v":1},null,null,1,null,null,"抗がん剤","単独投与　投与器具は毎回破棄　曝露に注意","レブラミドカプセル　５ｍｇ","院内採用"]
["レベトールカプセル２００ｍｇ","MSD",null,"▲",1,{"$f":"IF(G943&H943&I943&I943&J943&K943=\"\",\"\",IF(G943&H943&I943&J943=\"\",K943,IF(G943&H943&I943=\"\",J943,(IF(G943&H943=\"\",I943,IF(G943=\"\",H943,G943))))))","v":1},{"$nulls":3},1,null,"カプセルがゼラチンのため溶解は可だが催奇形性・原薬の刺激性あり","単独投与　投与器具は毎回破棄　曝露に注意","レベトールカプセル２００ｍｇ"]
["レボセチリジン塩酸塩錠5mg「武田デバ」",{"$nulls":3},1,null,null,1,{"$nulls":3},"オーソライズドジェネリックのため先発と同一",null,null,"院内採用"]
["レボノルゲストレル錠1.5mg「F」",{"$nulls":3},1,{"$nulls":3},1,{"$nulls":5},"院内採用"]
["レボフロキサシン錠２５０ｍｇ「DSEP]","第一三共エスファ",null,"▲",2,{"$f":"IF(G946&H946&I946&I946&J946&K946=\"\",\"\",IF(G946&H946&I946&J946=\"\",K946,IF(G946&H946&I946=\"\",J946,(IF(G946&H946=\"\",I946,IF(G946=\"\",H946,G946))))))","v":2},null,null,2,{"$nulls":4},"レボフロキサシン錠２５０ｍｇ「DSEP]","院内採用"]
["レボフロキサシン錠５００ｍｇ「DSEP]","第一三共エスファ",null,"●",2,{"$f":"IF(G947&H947&I947&I947&J947&K947=\"\",\"\",IF(G947&H947&I947&J947=\"\",K947,IF(G947&H947&I947=\"\",J947,(IF(G947&H947=\"\",I947,IF(G947=\"\",H947,G947))))))","v":2},null,null,2,{"$nulls":4},"レボフロキサシン錠５００ｍｇ「DSEP]","院内採用"]
["レボレード錠　１２．５ｍｇ","グラクソ",null,"×",6,{"$f":"IF(G948&H948&I948&I948&J948&K948=\"\",\"\",IF(G948&H948&I948&J948=\"\",K948,IF(G948&H948&I948=\"\",J948,(IF(G948&H948=\"\",I948,IF(G948=\"\",H948,G948))))))","v":6},null,null,6,null,null,"懸濁するとAUC22％上昇のため不適　錠剤粉砕可",null,"レボレード錠　１２．５ｍｇ","院内採用"]
["レミッチOD2.5μｇ",{"$nulls":3},6,{"$nulls":3},6,null,null,"温湯で懸濁すると、11.6%含量低下するとのこと　水での検討はされていない（温湯で懸濁後、懸濁、チューブ通過性は問題ないが、含量低下のデータあるため不可）",null,null,"院内採用"]
["レミッチカプセル2.5μｇ",{"$nulls":3},6,{"$nulls":3},6,null,null,"乳白色の固まりができる　Drと要相談（代替薬なし）→外用薬等へ切り替える"]
["レミニールＯＤ錠　４ｍｇ","武田","ヤンセン","▲",1,{"$f":"IF(G951&H951&I951&I951&J951&K951=\"\",\"\",IF(G951&H951&I951&J951=\"\",K951,IF(G951&H951&I951=\"\",J951,(IF(G951&H951=\"\",I951,IF(G951=\"\",H951,G951))))))","v":1},{"$nulls":3},1,{"$nulls":3},"レミニールＯＤ錠　４ｍｇ","院内採用"]
["レルミナ錠40mg",{"$nulls":3},1,{"$nulls":3},1,{"$nulls":5},"院内採用"]
["レルミナ錠40mg",{"$nulls":3},1,{"$nulls":3},1,{"$nulls":5},"院内採用"]
["レンビマカプセル10mg",{"$nulls":3},1,{"$nulls":3},1]
["レンビマカプセル4mg",{"$nulls":3},1,{"$nulls":3},1]
["ロイケリン散　１０％",{"$nulls":3},1,{"$f":"IF(G956&H956&I956&I956&J956&K956=\"\",\"\",IF(G956&H956&I956&J956=\"\",K956,IF(G956&H956&I956=\"\",J956,(IF(G956&H956=\"\",I956,IF(G956=\"\",H956,G956))))))","v":1},null,1,{"$nulls":3},"抗がん剤","単独投与　投与器具は毎回破棄　曝露に注意","ロイケリン散　１０％","院内採用"]
["ロイコボリン錠５ｍｇ","ファイザー",null,"▲",1,{"$f":"IF(G957&H957&I957&I957&J957&K957=\"\",\"\",IF(G957&H957&I957&J957=\"\",K957,IF(G957&H957&I957=\"\",J957,(IF(G957&H957=\"\",I957,IF(G957=\"\",H957,G957))))))","v":1},null,1,{"$nulls":5},"ロイコボリン錠５ｍｇ"]
["ロイコン錠１０ｍｇ",null,null,"▲",1,{"$f":"IF(G958&H958&I958&I958&J958&K958=\"\",\"\",IF(G958&H958&I958&J958=\"\",K958,IF(G958&H958&I958=\"\",J958,(IF(G958&H958=\"\",I958,IF(G958=\"\",H958,G958))))))","v":1},null,1,{"$nulls":5},"ロイコン錠１０ｍｇ"]
["ローブレナ錠25mg",{"$nulls":3},6,null,null,6,{"$nulls":3},"抗がん剤　代用薬ないため主治医判断　特殊な懸濁法あり　懸濁法別紙（ファイルにあり）参照。","単独投与　投与器具は毎回破棄　曝露に注意"]
["ロカルトロ－ルカプセル０．５μg",null,null,"▲",1,{"$f":"IF(G960&H960&I960&I960&J960&K960=\"\",\"\",IF(G960&H960&I960&J960=\"\",K960,IF(G960&H960&I960=\"\",J960,(IF(G960&H960=\"\",I960,IF(G960=\"\",H960,G960))))))","v":1},null,1,{"$nulls":5},"ロカルトロ－ルカプセル０．５μg","院内採用"]
["ロキソプロフェン錠６０ｍｇ　「ＥＭＥC」",null,null,"●",2,{"$f":"IF(G961&H961&I961&I961&J961&K961=\"\",\"\",IF(G961&H961&I961&J961=\"\",K961,IF(G961&H961&I961=\"\",J961,(IF(G961&H961=\"\",I961,IF(G961=\"\",H961,G961))))))","v":2},null,2,{"$nulls":5},"ロキソプロフェン錠６０ｍｇ　「ＥＭＥC」","院内採用"]
["ロサルタンカリウム錠50mg「サワイ」",{"$nulls":3},2,{"$nulls":3},2,{"$nulls":5},"院内採用"]
["ロサルヒド配合錠LD「EE」",{"$nulls":3},2,{"$nulls":3},2,{"$nulls":5},"院内採用"]
["ロスーゼット配合錠HD",{"$nulls":3},6,{"$nulls":3},6,null,null,"データなし　ゼチーア10mg＋ロスバスタチン2.5mg×2錠（簡易懸濁可）へ変更"]
["ロスバスタチンOD錠2.5mg「トーワ」",{"$nulls":3},1,{"$nulls":3},1,{"$nulls":5},"院内採用"]
["ロゼレム錠８ｍｇ","武田",null,"●",2,{"$f":"IF(G966&H966&I966&I966&J966&K966=\"\",\"\",IF(G966&H966&I966&J966=\"\",K966,IF(G966&H966&I966=\"\",J966,(IF(G966&H966=\"\",I966,IF(G966=\"\",H966,G966))))))","v":2},null,null,2,{"$nulls":4},"ロゼレム錠８ｍｇ","院内採用"]
["ロトリガ粒状カプセル2g",{"$nulls":3},6,{"$nulls":3},6,null,null,"データーなし　用量確認後、適応同じであれば同成分のイコサペント酸エチル（簡易懸濁可）へ変更を主治医と相談",null,null,"院内採用"]
["ロペミンカプセル　１ｍｇ　","ヤンセン",null,"●",1,{"$f":"IF(G968&H968&I968&I968&J968&K968=\"\",\"\",IF(G968&H968&I968&J968=\"\",K968,IF(G968&H968&I968=\"\",J968,(IF(G968&H968=\"\",I968,IF(G968=\"\",H968,G968))))))","v":1},null,1,{"$nulls":5},"ロペミンカプセル　１ｍｇ　"]
["ロペラミド塩酸塩カプセル1mg「サワイ」",null,null,"●",1,{"$f":"IF(G969&H969&I969&I969&J969&K969=\"\",\"\",IF(G969&H969&I969&J969=\"\",K969,IF(G969&H969&I969=\"\",J969,(IF(G969&H969=\"\",I969,IF(G969=\"\",H969,G969))))))","v":1},null,null,1]
["ロペラミド塩酸塩カプセル1mg「サワイ」",{"$nulls":3},1,null,null,1,{"$nulls":6},"院内採用"]
["ロラゼパム錠0.5mg「サワイ」",{"$nulls":3},1,{"$nulls":3},1,{"$nulls":5},"院内採用"]
["ロルカム錠４ｍｇ",null,null,"▲",1,{"$f":"IF(G972&H972&I972&I972&J972&K972=\"\",\"\",IF(G972&H972&I972&J972=\"\",K972,IF(G972&H972&I972=\"\",J972,(IF(G972&H972=\"\",I972,IF(G972=\"\",H972,G972))))))","v":1},null,1,{"$nulls":5},"ロルカム錠４ｍｇ"]
["ワーファリン錠１ｍｇ",null,null,"●",1,1,null,1,{"$nulls":5},"ワーファリン錠１ｍｇ","院内採用"]
["ワイパックス錠　０．５ｍｇ",null,null,"●",1,1,null,1,{"$nulls":5},"ワイパックス錠　０．５ｍｇ"]
["ワソラン錠４０ｍｇ",null,null,"●",2,2,null,2,{"$nulls":5},"ワソラン錠４０ｍｇ","院内採用"]
["ワンアルファ錠　０．２５μｇ",null,null,"●",1,1,null,1,{"$nulls":5},"ワンアルファ錠　０．２５μｇ"]
["ワンアルファ錠　１μｇ",null,null,"●",1,1,null,1,{"$nulls":5},"ワンアルファ錠　１μｇ"]
["ワントラム錠100mg",{"$nulls":3},6,{"$nulls":3},6,null,null,"徐放錠のため不可　粉砕不可のためDｒと要相談　同効薬トラムセット（トラマドール37.5mg+アセトアミノフェン325mg）　",null,null,"院内採用"]
["塩酸プロカルバジンカプセル　５０ｍｇ","中外",null,"×",4,{"$f":"IF(G979&H979&I979&I979&J979&K979=\"\",\"\",IF(G979&H979&I979&J979=\"\",K979,IF(G979&H979&I979=\"\",J979,(IF(G979&H979=\"\",I979,IF(G979=\"\",H979,G979))))))","v":1},null,1,{"$nulls":3},"抗がん剤","単独投与　投与器具は毎回破棄　曝露に注意","塩酸プロカルバジンカプセル　５０ｍｇ"]
["塩酸ミノサイクリンカプセル１００「日医工」","日医工",null,"●",1,1,null,1,{"$nulls":3},"色が濃いのでフラッシュ必要","　","塩酸ミノサイクリンカプセル１００「日医工」","院内採用"]
["酸化マグネシウム３３０ｍｇ　「ヨシダ」",null,null,"×",4,1,null,1,{"$nulls":5},"マグラックス錠３３０ｍｇ　","院内採用"]
["臭化カリウム　１０ｇ「ヤマゼン」","山善",null,null,1,1,null,null,1,{"$nulls":4},"臭化カリウム　１００ｇ","院内採用"]
["炭酸水素ナトリウム　５００ｇ「シオエ」","日本新薬","シオエ",null,1,1,{"$nulls":3},1,null,"アルカリ性になる　「シオエ」のデータはないが可と考える",null,"炭酸水素ナトリウム　５００ｇ「シオエ」","院内採用"]
["調剤用パンビタン末","武田",null,null,1,1,{"$nulls":3},1,{"$nulls":3},"調剤用パンビタン末","院内採用"]
["乳酸カルシウム「ハチ」1g/包　",{"$nulls":3},1,1,null,1,{"$nulls":5},"乳酸カルシウム「ヨシダ」　","院内採用"]
["乳糖　（粒状）　５００ｇ","健栄",null,null,1,1,null,null,1,{"$nulls":4},"乳糖　（粒状）　５００ｇ","院内採用"]
["硫酸ポリミキシンＢ錠100万単位","ファイザ-",null,"▲",6,6,null,6,6,null,null,"データなし　錠剤粉砕可（苦みと吸湿性あり）",null,"硫酸ポリミキシンＢ錠100万単位"]
[{"$nulls":11},"※腸溶錠はチューブが腸まで挿入されている場合は簡易懸濁可。"]

{"sheet":"20150723マスター条件","index":2,"n_rows":17,"n_cols":10,"rows_kept":17,"hidden":true}
[]
[null,"簡易懸濁マスタ＠堺市立総合医療センター"]
[]
[null,null,"フラグコメント"]
[null,"a.無し",null,"→不使用",{"$nulls":5},"他院DB"]
[null,"b.懸濁可","簡易懸濁可","→使用",{"$nulls":5},"国立病院機構　東京医療センター"]
[null,"c.破壊","★破壊★　簡易懸濁可","→使用",{"$nulls":5},"焼津市民病院"]
[null,"d.粉砕",null,"→不使用",{"$nulls":5},"川崎"]
[null,"e.条件付",null,"→不使用"]
[null,"f.懸濁不可",null,"→不使用（ユヤマシステム上突破不可能）"]
[null,"g.懸濁不適","簡易懸濁不適","→使用（ユヤマシステム上突破可能）"]
[]
[null,"b.懸濁可、c.破壊、g.懸濁不適のフラグを使用。各フラグコメント（最大全角30文字）が薬袋に印刷される。"]
[null,"フラグコメント以外のコメントを追加で印刷する場合は、薬剤コメント（最大全角30文字）に入れる。"]
[]
[null,"薬剤コメント"]
[null,"簡易懸濁可の抗がん剤：単独投与　投与器具は毎回破棄　暴露に注意"]

{"sheet":"21050723","index":3,"n_rows":645,"n_cols":13,"rows_kept":645,"hidden":true}
["2015.2月末の当院採用薬品",null,null,"一包化→●カセット　▲DTA　×一包化しない",{"$nulls":5},"簡易懸濁→a.無し b.懸濁可 c.破壊 d.粉砕 e.条件付 f.懸濁不可 g.懸濁不適"]
["薬品名","販売","製造","一包化最終決定","簡易懸濁最終決定","特殊等","ハンドブック","メーカー","他院DB","実験","条件","薬剤コメント(30文字以内)","薬品名"]
["Ｄ－ソルビトール","丸石",null,null,{"$f":"IF(F3&G3&H3&H3&I3&J3=\"\",\"\",IF(F3&G3&H3&I3=\"\",J3,IF(F3&G3&H3=\"\",I3,(IF(F3&G3=\"\",H3,IF(F3=\"\",G3,F3))))))","v":"g"},{"$nulls":3},"g",null,"14Fr.は可　液の製剤がある様子",null,"Ｄ－ソルビトール"]
["Ｌ－ケフレックス顆粒　５００ｍｇ",{"$nulls":3},"g",null,"g",{"$nulls":5},"Ｌ－ケフレックス顆粒　５００ｍｇ"]
["ＰＬ配合顆粒",{"$nulls":3},"b",null,"b",{"$nulls":4},"多めの水でフラッシュ","ＰＬ配合顆粒"]
["Ｓ・Ｍ散",{"$nulls":3},"b",null,"b",{"$nulls":5},"Ｓ・Ｍ散"]
["アーチスト錠１０ｍｇ",null,null,"●","b",null,"b",{"$nulls":5},"アーチスト錠１０ｍｇ"]
["アーチスト錠２．５ｍｇ","第一三共",null,"●","b",null,null,"b",{"$nulls":4},"アーチスト錠２．５ｍｇ"]
["アーテン錠（２ｍｇ）　",null,null,"▲","b",null,"b",{"$nulls":5},"アーテン錠（２ｍｇ）　"]
["アイセントレス錠４００ｍｇ","MSD",null,"×","c","c","g",{"$nulls":3},"HIV/破壊し長時間かければ投与可（大阪医療センターで症例あり）","通常より時間をかけて懸濁","アイセントレス錠４００ｍｇ"]
["アイトロール錠２０ｍｇ",null,null,"▲","b",null,"b",{"$nulls":5},"アイトロール錠２０ｍｇ"]
["アカルディカプセル１．２５ｍｇ",null,null,"×","b",null,"b",{"$nulls":5},"アカルディカプセル１．２５ｍｇ"]
["アキネトン錠　１ｍｇ",null,null,"▲","b",null,"b",{"$nulls":5},"アキネトン錠　１ｍｇ"]
["アクトス錠１５",null,null,"▲","b",null,"b",{"$nulls":5},"アクトス錠１５"]
["アクトネル錠２．５ｍｇ","エーザイ","味のもと","▲","b",null,null,"b",null,null,"17.5mgのデータ参照",null,"アクトネル錠２．５ｍｇ"]
["アコファイド錠100ｍｇ","ゼリア",null,"▲","b",null,null,"b",{"$nulls":4},"アコファイド錠100ｍｇ"]
["アサコール錠４００ｍｇ","協和発酵キリン","ゼリア","×","g",null,null,"g",null,null,"腸溶錠のため腸瘻からであれば破壊後懸濁可",null,"アサコール錠４００ｍｇ"]
["アザルフィジンＥＮ錠　５００ｍｇ",null,null,"▲","g",null,"g",{"$nulls":3},"腸溶錠のため腸瘻からであれば破壊後懸濁可",null,"アザルフィジンＥＮ錠　５００ｍｇ"]
["アシノン錠１５０ｍｇ",null,null,"▲","b",null,"b",{"$nulls":5},"アシノン錠１５０ｍｇ"]
["アジャストＡコーワ錠４０ｍｇ","興和創薬",null,"●","g",null,"g",{"$nulls":3},"ピコスルファートで代用",null,"アジャストＡコーワ錠４０ｍｇ"]
["アジルバ錠４０ｍｇ","武田",null,"●","b",null,null,"b",{"$nulls":4},"アジルバ錠４０ｍｇ"]
["アスパラカリウム散　５０％","田辺製薬販売",null,null,"g","g",{"$nulls":6},"アスパラカリウム散　５０％"]
["アスパラカリウム錠　３００ｍｇ",null,null,"×","g",null,"g",{"$nulls":5},"アスパラカリウム錠　３００ｍｇ"]
["アスピリン","日本新薬","シオエ",null,"b",{"$nulls":3},"b",null,"溶解しないが懸濁状態で通過",null,"アスピリン"]
["アスペノンカプセル１０ｍｇ",null,null,"▲","b",null,"b",{"$nulls":3},"アスペノンカプセル20mg参照",null,"アスペノンカプセル１０ｍｇ"]
["アセチルスピラマイシン錠　２００ｍｇ",null,null,"▲","b",null,"b",{"$nulls":5},"アセチルスピラマイシン錠　２００ｍｇ"]
["アセトアミノフェン「マルイシ」",{"$nulls":3},"b","b","g",null,null,"b","ハンドブックは12Fr.　溶解しないが実験では1gは8Fr.通過（フラッシュは多めで）","多めの水でフラッシュ","アセトアミノフェン「マルイシ」"]
["アタラックス－Ｐカプセル２５ｍｇ　",null,null,"▲","b",null,"b",{"$nulls":3},"多めの水でフラッシュ","多めの水でフラッシュ","アタラックス－Ｐカプセル２５ｍｇ　"]
["アタラックス-Pドライシロップ2.5%","ファイザー",null,null,"b","b",{"$nulls":4},"アタラックスPカプセルは懸濁可/簡易懸濁データなし","単独投与　常温の水で懸濁","アタラックス-Pドライシロップ2.5%"]
["アデホスコーワ顆粒１０％",{"$nulls":3},"g",null,"g",{"$nulls":5},"アデホスコーワ顆粒１０％"]
["アテレック錠　１０ｍｇ",null,null,"●","b",null,"b",{"$nulls":5},"アテレック錠　１０ｍｇ"]
["アドシルカ錠20ｍｇ","リリー","日本新薬","▲","b",{"$nulls":3},"b",{"$nulls":3},"アドシルカ錠20ｍｇ"]
["アドソルビン",{"$nulls":3},"b",null,"b",{"$nulls":4},"単独投与　他剤や食事と1時間以上間隔をあけるほうが良い","アドソルビン"]
["アドナ錠３０ｍｇ　",null,null,"●","b",null,"b",{"$nulls":5},"アドナ錠３０ｍｇ　"]
["アトルバスタチンOD錠10mg「トーワ」","東和",null,"●","b",null,null,"b",{"$nulls":4},"アトルバスタチンOD錠10mg「トーワ」"]
["アナフラニール錠１０ｍｇ",null,null,"▲","c",null,"c",{"$nulls":5},"アナフラニール錠１０ｍｇ"]
["アフィニトール錠　５ｍｇ","ノバルティス",null,"×","b",null,"b",{"$nulls":3},"抗がん剤","単独投与　投与器具は毎回破棄　暴露に注意","アフィニトール錠　５ｍｇ"]
["アプレゾリン錠１０ｍｇ　",null,null,"▲","c",null,"c",{"$nulls":3},"★破壊★　多めの水でフラッシュ","多めの水でフラッシュ","アプレゾリン錠１０ｍｇ　"]
["アベロックス錠４００ｍｇ","富士フィルム","バイエル","▲","b",null,"b",{"$nulls":5},"アベロックス錠４００ｍｇ"]
["アボルブカプセル　０．５ｍｇ","グラクソ",null,"×","g",null,null,"g",null,null,"カプセル内脂溶性液体・口腔内刺激あり",null,"アボルブカプセル　０．５ｍｇ"]
["アマリ－ル１ｍｇ錠",null,null,"▲","b",null,"b",{"$nulls":5},"アマリ－ル１ｍｇ錠"]
["アミサリン錠１２５ｍｇ",null,null,"▲","g",null,"g",{"$nulls":5},"アミサリン錠１２５ｍｇ"]
["アミティーザカプセル24μｇ","スキャンポファーマ",null,"●","b",null,null,"b",{"$nulls":4},"アミティーザカプセル24μｇ"]
["アムノレイク錠２ｍｇ","日本新薬","東光","×","g",{"$nulls":3},"g",null,"抗がん剤",null,"アムノレイク錠２ｍｇ"]
["アムロジピンＯＤ錠5ｍｇ「ＥＭＥＣ」",null,null,"●","b",null,"b",{"$nulls":5},"アムロジピンＯＤ錠5ｍｇ「ＥＭＥＣ」"]
["アメパロモカプセル250ｍｇ","ファイザー",null,"▲","g","g",{"$nulls":4},"必要時相談",null,"アメパロモカプセル250ｍｇ"]
["アモキサンカプセル２５ｍｇ",null,null,"▲","b",null,"b",{"$nulls":4},"多めの水でフラッシュ","アモキサンカプセル２５ｍｇ"]
["アモキシシリンカプセル250mg「日医工」","日医工",null,"▲","b",null,"b",{"$nulls":3},"内容物粒子が大きめで大量のため十分なフラッシュを","多めの水でフラッシュ","アモキシシリンカプセル250mg「日医工」"]
["アリセプトＤ錠３ｍｇ",null,null,"▲","b",null,"b",{"$nulls":5},"アリセプトＤ錠３ｍｇ"]
["アリセプトＤ錠５ｍｇ",null,null,"▲","b",null,"b",{"$nulls":5},"アリセプトＤ錠５ｍｇ"]
["アリナミンＦ糖衣錠２５ｍｇ　",null,null,"▲","c",null,"c",{"$nulls":5},"アリナミンＦ糖衣錠２５ｍｇ　"]
["アリミデックス錠　１ｍｇ","アストラゼネカ",null,"×","b",null,"b",{"$nulls":3},"抗がん剤","単独投与　投与器具は毎回破棄　暴露に注意","アリミデックス錠　１ｍｇ"]
["アルケラン錠　２ｍｇ",null,null,"×","b",null,"b",{"$nulls":3},"抗がん剤","単独投与　投与器具は毎回破棄　暴露に注意","アルケラン錠　２ｍｇ"]
["アルサルミン細粒　９０％",{"$nulls":3},"b",null,"b",{"$nulls":5},"アルサルミン細粒　９０％"]
["アルダクトンＡ錠　２５ｍｇ　",null,null,"●","b",null,"b",{"$nulls":5},"アルダクトンＡ錠　２５ｍｇ　"]
["アルドメット錠　２５０ｍｇ",null,null,"▲","b",null,"b",{"$nulls":3},"ドパミン製剤のため酸化マグネシウムと同時懸濁しない","酸化ﾏｸﾞﾈｼｳﾑ(ﾏｸﾞﾗｯｸｽ等)と同時懸濁しない/多めの水でﾌﾗｯｼｭ","アルドメット錠　２５０ｍｇ"]
["アルファロール散　１μｇ／ｇ","中外",null,null,"b",null,null,"b",{"$nulls":4},"アルファロール散　１μｇ／ｇ"]
["アレセンサカプセル20ｍｇ","中外",null,"×","b",null,null,"b",null,null,"抗がん剤","単独投与　投与器具は毎回破棄　暴露に注意","アレセンサカプセル20ｍｇ"]
["アレセンサカプセル40ｍｇ","中外",null,"×","b",null,null,"b",null,null,"抗がん剤","単独投与　投与器具は毎回破棄　暴露に注意","アレセンサカプセル40ｍｇ"]
["アレビアチン散１０％","大日本住友",null,null,"b",{"$nulls":3},"b",{"$nulls":3},"アレビアチン散１０％"]
["アレロック顆粒０．５％","協和発酵キリン",null,null,"g",null,null,"g",{"$nulls":4},"アレロック顆粒０．５％"]
["アロチノロール塩酸塩錠１０ｍｇ「ＤＳＰ」","大日本住友",null,"▲","b",null,"b",{"$nulls":3},"溶けにくいため5分ぐらい長めに置くと通過",null,"アロチノロール塩酸塩錠１０ｍｇ「ＤＳＰ」"]
["アロプリノール錠100ｍｇ「杏林」","杏林",null,"●","b",null,"b",{"$nulls":5},"アロプリノール錠100ｍｇ「杏林」"]
["アロマシン錠25ｍｇ","ファイザー",null,"×","b",null,"b",{"$nulls":3},"抗がん剤","単独投与　投与器具は毎回破棄　暴露に注意","アロマシン錠25ｍｇ"]
["アンカロン錠100ｍｇ",null,null,"▲","b",null,"b",{"$nulls":3},"多めの水でフラッシュ","多めの水でフラッシュ","アンカロン錠100ｍｇ"]
["アンコチル錠500ｍｇ",null,null,"▲","b",null,"b",{"$nulls":5},"アンコチル錠500ｍｇ"]
["アンナカ「ヨシダ」",{"$nulls":3},{"$f":"IF(F67&G67&H67&H67&I67&J67=\"\",\"\",IF(F67&G67&H67&I67=\"\",J67,IF(F67&G67&H67=\"\",I67,(IF(F67&G67=\"\",H67,IF(F67=\"\",G67,F67))))))","v":"b"},null,"b",{"$nulls":5},"アンナカ「ヨシダ」"]
["アンブロキソール塩酸塩錠15mg「サワイ」","沢井",null,"●","b",null,"b",{"$nulls":5},"アンブロキソール塩酸塩錠15mg「サワイ」"]
["アンブロキソール塩酸塩徐放OD錠45mg「サワイ」","沢井",null,"●","b",null,null,"b",{"$nulls":4},"アンブロキソール塩酸塩徐放OD錠45mg「サワイ」"]
["イーケプラDS50%","大塚製薬",null,null,"b",null,null,"b",{"$nulls":4},"イーケプラDS50%"]
["イーケプラ錠250ｍｇ","ＵＣＢ","大塚","●","c",null,"c",{"$nulls":5},"イーケプラ錠250ｍｇ"]
["イーケプラ錠500ｍｇ","ＵＣＢ","大塚","▲","c",null,"c",{"$nulls":5},"イーケプラ錠500ｍｇ"]
["イグザレルト錠10ｍｇ","バイエル",null,"●","b",null,"b",{"$nulls":5},"イグザレルト錠10ｍｇ"]
["イグザレルト錠15ｍｇ","バイエル",null,"▲","b",null,"b",{"$nulls":5},"イグザレルト錠15ｍｇ"]
["イクスタンジカプセル40ｍｇ","アステラス",null,"×","g",null,null,"g",null,null,"抗がん剤/難水性の溶剤を充填",null,"イクスタンジカプセル40ｍｇ"]
["イコサペント酸エチル粒状カプセル９００ｍｇ　「サワイ」",{"$nulls":3},"b",null,"b",{"$nulls":5},"イコサペント酸エチル粒状カプセル９００ｍｇ　「サワイ」"]
["イスコチン錠100ｍｇ",null,null,"●","b",null,"b",{"$nulls":5},"イスコチン錠100ｍｇ"]
["イスコチン末１００％　１００ｇ","第一三共",null,null,"b",{"$nulls":3},"b",{"$nulls":3},"イスコチン末１００％　１００ｇ"]
["イトラコナゾール錠100「ＭＥＥＫ」","Ｍｅｉｊｉ","小林化工","▲","c ",null,null,"c ",{"$nulls":4},"イトラコナゾール錠100「ＭＥＥＫ」"]
["イノベロン錠200ｍｇ","エーザイ",null,"▲","b",null,null,"b",null,null,"沈殿性浮遊物あるが8Fr.通過",null,"イノベロン錠200ｍｇ"]
["イミグラン錠５０","グラクソ",null,"▲","b",null,"b","b",{"$nulls":4},"イミグラン錠５０"]
["イムセラカプセル0.5mg","田辺三菱",null,"×","g","g",{"$nulls":4},"必要時相談",null,"イムセラカプセル0.5mg"]
["イムラン錠50ｍｇ",null,null,"▲","b",null,"b",{"$nulls":3},"多めの水でフラッシュ","多めの水でフラッシュ","イムラン錠50ｍｇ"]
["イメンドカプセル 80ｍｇ","小野",null,"×","g","g",{"$nulls":4},"プロイメンドあり",null,"イメンドカプセル 80ｍｇ"]
["イメンドカプセル125ｍｇ","小野",null,"×","g","g",{"$nulls":4},"プロイメンドあり",null,"イメンドカプセル125ｍｇ"]
["イリボーＯＤ錠５μｇ","アステラス",null,"▲","b",null,null,"b",null,null,"ガラス容器だと吸着",null,"イリボーＯＤ錠５μｇ"]
["イレッサ錠２５０","アストラゼネカ",null,"×","b",null,"b",{"$nulls":3},"抗がん剤","単独投与　投与器具は毎回破棄　暴露に注意","イレッサ錠２５０"]
["インタール細粒１０％","サノフィ",null,null,"b",{"$nulls":3},"b",{"$nulls":3},"インタール細粒１０％"]
["インデラル錠１０ｍｇ",null,null,"▲","b",null,"b",{"$nulls":3},"多めの水でフラッシュ","多めの水でフラッシュ","インデラル錠１０ｍｇ"]
["インフリーＳカプセル２００ｍｇ",null,null,"▲","g",null,"g",{"$nulls":5},"インフリーＳカプセル２００ｍｇ"]
["インライタ錠１ｍｇ","ファイザー",null,"×","g",{"$nulls":3},"g",null,"抗がん剤",null,"インライタ錠１ｍｇ"]
["インライタ錠５ｍｇ","ファイザー",null,"×","g",{"$nulls":3},"g",null,"抗がん剤",null,"インライタ錠５ｍｇ"]
["ヴアイデックスＥＣカプセル１２５　","ブリストルマイヤーズ",null,"×","g",null,"g",{"$nulls":3},"HIV",null,"ヴアイデックスＥＣカプセル１２５　"]
["ヴォトリエント錠200ｍｇ","グラクソ",null,"×","g",null,null,"g",null,null,"抗がん剤/粉砕するとCmax/AUC増加する",null,"ヴォトリエント錠200ｍｇ"]
["ウテメリン　５ｍｇ　",null,null,"▲","b",null,"b",{"$nulls":5},"ウテメリン　５ｍｇ　"]
["ウブレチド錠　５ｍｇ",null,null,"▲","b",null,"b",{"$nulls":5},"ウブレチド錠　５ｍｇ"]
["ウラリット配合錠",null,null,"●","c",null,"c",{"$nulls":5},"ウラリット配合錠"]
["ウリトスＯＤ錠　０．１ｍｇ","杏林",null,"▲","b",null,null,"b",{"$nulls":4},"ウリトスＯＤ錠　０．１ｍｇ"]
["ウルソ錠１００ｍｇ",null,null,"●","b",null,"b",{"$nulls":5},"ウルソ錠１００ｍｇ"]
["ウロカルン錠２２５ｍｇ",null,null,"▲","g",null,"g",{"$nulls":5},"ウロカルン錠２２５ｍｇ"]
["エクア錠　５０ｍｇ","ノバルティス",null,"●","b",{"$nulls":3},"b",{"$nulls":3},"エクア錠　５０ｍｇ"]
["エクジェイド懸濁用５００ｍｇ","ノバルティス",null,"×","g","g",{"$nulls":4},"懸濁に100mL必要",null,"エクジェイド懸濁用５００ｍｇ"]
["エクセグラン散　２０％",{"$nulls":3},"b",null,"b",{"$nulls":5},"エクセグラン散　２０％"]
["エクセグラン錠１００ｍｇ",null,null,"▲","b",null,"b",{"$nulls":5},"エクセグラン錠１００ｍｇ"]
["エジュラント錠25ｍｇ","ヤンセン",null,"×","g","g",{"$nulls":4},"HIV/固形物摂取が必要",null,"エジュラント錠25ｍｇ"]
["エスカゾール錠200ｍｇ","グラクソ",null,"▲","b",null,null,"b",{"$nulls":4},"エスカゾール錠200ｍｇ"]
["エストラサイトカプセル　１５６．７ｍｇ","日新",null,"×","b",null,"b",{"$nulls":3},"抗がん剤","単独投与　投与器具は毎回破棄　暴露に注意","エストラサイトカプセル　１５６．７ｍｇ"]
["エチゾラム錠0.5ｍｇ「ＥＭＥＣ」",null,null,"●","b",null,"b",{"$nulls":5},"エチゾラム錠0.5ｍｇ「ＥＭＥＣ」"]
["エディロールカプセル０．７５μｇ","中外",null,"▲","g",null,null,"g",{"$nulls":4},"エディロールカプセル０．７５μｇ"]
["エナラプリルＭ錠５「ＥＭＥＣ」","エルドメットエーザイ",null,"●","b",null,null,"b",{"$nulls":4},"エナラプリルＭ錠５「ＥＭＥＣ」"]
["エバステル錠１０ｍｇ","大日本住友",null,"▲","b",null,"b","b",null,null,"常温の水で懸濁","常温の水で懸濁","エバステル錠１０ｍｇ"]
["エピビル錠　１５０ｍｇ","グラクソ","ヴィープ","×","b",null,"b","b",null,null,"HIV",null,"エピビル錠　１５０ｍｇ"]
["エビプロスタット配合錠ＤＢ",null,null,"▲","g",null,"g",{"$nulls":3},"腸溶錠",null,"エビプロスタット配合錠ＤＢ"]
["エフィエント錠3.75ｍｇ","第一三共",null,"●","b",{"$nulls":4},"b","メーカーより30℃10分はOK（30分おくのは不可）55℃10分放置は類縁物質増加→常温の水で実験してOK","常温の水で懸濁","エフィエント錠3.75ｍｇ"]
["エフィエント錠5ｍｇ","第一三共",null,"▲","b",{"$nulls":4},"b","メーカーより30℃10分はOK（30分おくのは不可）55℃10分放置は類縁物質増加→常温の水で実験してOK","常温の水で懸濁","エフィエント錠5ｍｇ"]
["エプジコム錠","ヴィーブ",null,"×","c",null,"c",{"$nulls":3},"HIV",null,"エプジコム錠"]
["エブトール２５０ｍｇ錠　",null,null,"●","g",null,"g",{"$nulls":5},"エブトール２５０ｍｇ錠　"]
["エフピ－ＯＤ錠２．５ｍｇ","エフピー",null,"×","b",null,null,"b",null,null,"覚せい剤原料","単独投与　投与器具は毎回破棄　暴露に注意","エフピ－ＯＤ錠２．５ｍｇ"]
["エブランチルカプセル１５ｍｇ　",null,null,"▲","g",null,"g",{"$nulls":3},"最小通過は14Frで多めの水でフラッシュ",null,"エブランチルカプセル１５ｍｇ　"]
["エリキュース錠（2.5ｍｇ）","ブリストルマイヤーズ",null,"●","b",null,"b",{"$nulls":5},"エリキュース錠（2.5ｍｇ）"]
["エリキュース錠（5ｍｇ）","ブリストルマイヤーズ",null,"●","b",null,"b",{"$nulls":5},"エリキュース錠（5ｍｇ）"]
["エリスロシンドライシロップ10%","アボット",null,null,"b","b",{"$nulls":4},"簡易懸濁データなし","単独投与　常温の水で懸濁","エリスロシンドライシロップ10%"]
["エリスロシン錠（２００ｍｇ）",null,null,"▲","c",null,"c",{"$nulls":5},"エリスロシン錠（２００ｍｇ）"]
["エルカルチンFF錠１００ｍｇ","大塚",null,"×","c",null,null,"c",{"$nulls":4},"エルカルチンFF錠１００ｍｇ"]
["塩化ナトリウム","大塚製薬工場",null,null,"b",{"$nulls":4},"b","他剤と同時に溶解すると塩析が起こるため単独で溶解して投与","単独投与　溶解は55℃温水でも常温の水でも可"]
["エンドキサン錠　５０ｍｇ",null,null,"×","g",null,"g",{"$nulls":3},"抗がん剤",null,"エンドキサン錠　５０ｍｇ"]
["オイグルコン錠１．２５ｍｇ","中外",null,"▲","b",null,"b",{"$nulls":5},"オイグルコン錠１．２５ｍｇ"]
["オーグメンチン配合錠２５０ＲＳ　（３７５ｍｇ）","グラクソ",null,"×","g",null,"g","g",null,null,"吸湿性強い　他院では簡易懸濁可としているデータもあり",null,"オーグメンチン配合錠２５０ＲＳ　（３７５ｍｇ）"]
["オ－クル錠　１００ｍｇ",null,null,"▲","c",null,"c",{"$nulls":5},"オ－クル錠　１００ｍｇ"]
["オゼックス細粒小児用１５％","大正富山",null,null,"b",null,null,"b",null,null,"データないが水に溶解するためOKと思われる",null,"オゼックス細粒小児用１５％"]
["オダイン錠　１２５ｍｇ","日本化薬",null,"×",{"$f":"IF(F131&G131&H131&H131&I131&J131=\"\",\"\",IF(F131&G131&H131&I131=\"\",J131,IF(F131&G131&H131=\"\",I131,(IF(F131&G131=\"\",H131,IF(F131=\"\",G131,F131))))))","v":"g"},null,"g",{"$nulls":3},"抗がん剤　時間をかければ通過するかも",null,"オダイン錠　１２５ｍｇ"]
["オノンドライシロップ10%","小野薬品",null,null,"b","b",{"$nulls":4},"プランルカスト錠は懸濁可/簡易懸濁データなし","単独投与　常温の水で懸濁","オノンドライシロップ10%"]
["オラセフ錠　２５０ｍｇ",null,null,"×","b",null,"b",{"$nulls":5},"オラセフ錠　２５０ｍｇ"]
["オルメテック錠２０ｍｇ","第一三共",null,"●","b",null,null,"b",{"$nulls":4},"オルメテック錠２０ｍｇ"]
["オロパタジン塩酸塩ＯＤ錠5mg「明治」","Ｍｅｉｊｉ",null,"●","b",null,"b",{"$nulls":5},"オロパタジン塩酸塩ＯＤ錠5mg「明治」"]
["カイトリル錠２ｍｇ",null,null,"×","b",null,"b",{"$nulls":3},"1mg参照",null,"カイトリル錠２ｍｇ"]
["ガスター散１０％　１００ｇ","アステラス",null,null,"b",{"$nulls":3},"b",{"$nulls":3},"ガスター散１０％　１００ｇ"]
["ガステール　４０ｍｇ","扶桑",null,"▲","b",null,"b",{"$nulls":5},"ガステール　４０ｍｇ"]
["ガストローム顆粒　６６．７％",{"$nulls":3},"g",null,"g",{"$nulls":5},"ガストローム顆粒　６６．７％"]
["ガスロンＮ錠４ｍｇ　",null,null,"●","b",null,"b",{"$nulls":5},"ガスロンＮ錠４ｍｇ　"]
["カソデックスＯＤ錠８０ｍｇ",null,null,"×","b",{"$nulls":3},"b",null,"抗がん剤","単独投与　投与器具は毎回破棄　暴露に注意","カソデックスＯＤ錠８０ｍｇ"]
["カタプレス錠７５　０．０７５ｍｇ",null,null,"×","b",null,"b",{"$nulls":5},"カタプレス錠７５　０．０７５ｍｇ"]
["カチーフＮ錠５ｍｇ","武田",null,"▲","b",{"$nulls":3},"b",{"$nulls":3},"カチーフＮ錠５ｍｇ"]
["ガナトン錠５０ｍｇ",null,null,"●","c",null,"c",{"$nulls":5},"ガナトン錠５０ｍｇ"]
["カナマイシンカプセル明治　２５０ｍｇ",null,null,"▲","b",null,"b",{"$nulls":5},"カナマイシンカプセル明治　２５０ｍｇ"]
["カバサ－ル錠　１ｍｇ",null,null,"▲","b",null,"b",{"$nulls":5},"カバサ－ル錠　１ｍｇ"]
["ガバペン錠２００ｍｇ","ファイザー",null,"▲","c",null,null,"c",null,null,"120mlのフラッシュで残留無し","多めの水でフラッシュ","ガバペン錠２００ｍｇ"]
["ガバペン錠３００ｍｇ","ファイザー",null,"▲","c",null,null,"c",null,null,"180ｍｌのフラッシュで残留無し","多めの水でフラッシュ","ガバペン錠３００ｍｇ"]
["カプトリル錠１２．５ｍｇ","第一三共エスファ",null,"▲","b",{"$nulls":3},"b",{"$nulls":3},"カプトリル錠１２．５ｍｇ"]
["ガランターゼ散　５０％　０．５ｇ","田辺製薬販売",null,null,"g","g",{"$nulls":4},"酵素製剤であり55℃では失活",null,"ガランターゼ散　５０％　０．５ｇ"]
["カルグート錠　５ｍｇ",null,null,"▲","b",null,"b",{"$nulls":5},"カルグート錠　５ｍｇ"]
["カルタンＯＤ錠５００ｍｇ","マイラン",null,"●","b",null,"b",{"$nulls":5},"カルタンＯＤ錠５００ｍｇ"]
["カルデナリン錠１ｍｇ",null,null,"●","b",null,"b",{"$nulls":5},"カルデナリン錠１ｍｇ"]
["カルナクリン錠５０　５０国際単位","三和化学",null,"▲","g",null,null,"g",null,null,"腸溶性",null,"カルナクリン錠５０　５０国際単位"]
["カルブロック錠１６ｍｇ",null,null,"●","c",null,"c",{"$nulls":5},"カルブロック錠１６ｍｇ"]
["カルボシステイン錠250ｍｇ「テバ」","テバ",null,"●","b",null,"b",{"$nulls":5},"カルボシステイン錠250ｍｇ「テバ」"]
["カレトラ配合錠","アッヴィ合同",null,"×","g",null,"g",{"$nulls":3},"HIV",null,"カレトラ配合錠"]
["カロナール錠　２００ｍｇ",null,null,"●","b",null,"b",{"$nulls":5},"カロナール錠　２００ｍｇ"]
["カンデサルタン錠８ｍｇ「あすか」","あすか",null,"●","b",null,null,"b",{"$nulls":4},"カンデサルタン錠８ｍｇ「あすか」"]
["キネダック錠　５０ｍｇ",null,null,"▲","b",null,"b",{"$nulls":5},"キネダック錠　５０ｍｇ"]
["きゅう帰調血飲エキス顆粒","太虎精堂",null,null,"b",null,null,"b",{"$nulls":4},"きゅう帰調血飲エキス顆粒"]
["クエチアピン錠25ｍｇ「ＤＳＥＰ」",null,null,"●","b",null,"b",{"$nulls":5},"クエチアピン錠25ｍｇ「ＤＳＥＰ」"]
["グッドミン錠０．２５ｍｇ",null,null,"●","b",null,"b",{"$nulls":5},"グッドミン錠０．２５ｍｇ"]
["グラケ－カプセル１５ｍｇ　",null,null,"▲","b",null,"b",{"$nulls":3},"油状物質付着で含量低下の可能性あり",null,"グラケ－カプセル１５ｍｇ　"]
["クラシエ十全大補湯エキス細粒",{"$nulls":3},"b",null,"b",{"$nulls":5},"クラシエ十全大補湯エキス細粒"]
["クラシエ当帰芍薬散料エキス細粒　２ｇ","クラシエ",null,null,"b",null,null,"b",{"$nulls":4},"クラシエ当帰芍薬散料エキス細粒　２ｇ"]
["クラシエ半夏厚朴湯","クラシエ",null,null,"b",null,null,"b",{"$nulls":4},"クラシエ半夏厚朴湯"]
["クラシエ芍薬甘草湯エキス細粒",{"$nulls":3},"b",null,"b",{"$nulls":5},"クラシエ芍薬甘草湯エキス細粒"]
["クラバモックス小児用配合ドライシロップ","グラクソ",null,null,"g","g",{"$nulls":4},"水薬として払い出し　高温で薬効低下するため溶解は常温の水を使用すること",null,"クラバモックス小児用配合ドライシロップ"]
["グラマリール錠２５ｍｇ　",null,null,"▲","c",null,"c",{"$nulls":5},"グラマリール錠２５ｍｇ　"]
["クラリシッド錠２００ｍｇ","アボット",null,"▲","b",null,null,"b",null,null,"クラリス同等",null,"クラリシッド錠２００ｍｇ"]
["クラリスドライシロップ10%小児用","大正富山",null,null,"b","b",{"$nulls":4},"クラリシッド錠は懸濁可/簡易懸濁データなし","単独投与　常温の水で懸濁","クラリスドライシロップ10%小児用"]
["グランダキシン錠５０ｍｇ　",null,null,"▲","b",null,"b",{"$nulls":3},"多めの水でフラッシュ","多めの水でフラッシュ","グランダキシン錠５０ｍｇ　"]
["グリチロン配合錠",null,null,"●","c",null,"c",{"$nulls":5},"グリチロン配合錠"]
["グリベック錠１００ｍｇ",null,null,"×","b",null,"b",{"$nulls":3},"抗がん剤","単独投与　投与器具は毎回破棄　暴露に注意","グリベック錠１００ｍｇ"]
["グリミクロン錠　４０ｍｇ",null,null,"▲","b",null,"b",{"$nulls":5},"グリミクロン錠　４０ｍｇ"]
["グルコバイ錠５０ｍｇ",null,null,"×","b",null,"b",{"$nulls":5},"グルコバイ錠５０ｍｇ"]
["グルコンサンＫ細粒　４ｍEq/g",{"$nulls":3},"b",null,"b",{"$nulls":5},"グルコンサンＫ細粒　４ｍEq/g"]
["グルファスト錠　１０ｍｇ","キッセイ",null,"▲","b",null,"b",{"$nulls":5},"グルファスト錠　１０ｍｇ"]
["クレストール錠２．５ｍｇ","アストラゼネカ",null,"●","b",{"$nulls":3},"b",{"$nulls":3},"クレストール錠２．５ｍｇ"]
["クレメジンカプセル２００ｍｇ",null,null,"×","b",null,"b",{"$nulls":3},"細粒に準ずる","単独投与　他剤服用後30分～1時間は間隔をあけるほうが良い","クレメジンカプセル２００ｍｇ"]
["クレメジン細粒分包２ｇ",{"$nulls":3},"b",null,"b",{"$nulls":3},"溶けないため振り混ぜながら注入　メーカーとしては他剤服用後30分～1時間は間隔をあけてから投与することを推奨。クレメジンを先に内服した場合はデータがないためなるべく長く間隔を空けるようにとのこと。","単独投与　他剤服用後30分～1時間は間隔をあけるほうが良い","クレメジン細粒分包２ｇ"]
["ケイキサレート散　５ｇ",{"$nulls":3},"b","b","g",{"$nulls":3},"2.5gあたり水20mLで懸濁し直後に注入（10分放置しない)","2.5gあたり水20mLで懸濁しすぐに注入","ケイキサレート散　５ｇ"]
["ケーサプライ錠600mg","アルフレッサ","佐藤薬品","●","g","g",{"$nulls":4},"徐放",null,"ケーサプライ錠600mg"]
["ケタスカプセル１０ｍｇ","杏林",null,"▲","g",null,"g","g",null,null,"12Fr.なら通過",null,"ケタスカプセル１０ｍｇ"]
["ケフラールカプセル２５０ｍｇ",null,null,"▲","b",null,"b",{"$nulls":5},"ケフラールカプセル２５０ｍｇ"]
["ケフラール細粒小児用１００ｍｇ",{"$nulls":3},"b",null,"b",{"$nulls":5},"ケフラール細粒小児用１００ｍｇ"]
["コデインリン酸塩「タケダ」　１％","武田",null,null,"b",{"$nulls":3},"b",null,"「タケダ」のデータはないが他施設DBでほぼ可となっている",null,"コデインリン酸塩「タケダ」　１％"]
["コ－トリル錠　１０ｍｇ",null,null,"▲","b",null,"b",{"$nulls":5},"コ－トリル錠　１０ｍｇ"]
["コニール錠４",null,null,"●","b",null,"b",{"$nulls":5},"コニール錠４"]
["コペガス錠２００ｍｇ","中外",null,"▲","g",null,null,"g",null,null,"55℃20mL30分放置で懸濁可",null,"コペガス錠２００ｍｇ"]
["コムタン錠１００ｍｇ","ノバルティス",null,"▲","b",null,"b",{"$nulls":3},"チューブが着色する場合あり（他院データ）",null,"コムタン錠１００ｍｇ"]
["コランチル配合顆粒　１ｇ",{"$nulls":3},"b",null,"b",{"$nulls":3},"多めの水でフラッシュ","多めの水でフラッシュ","コランチル配合顆粒　１ｇ"]
["コルヒチン錠「タカタ」　０．５ｍｇ","高田製薬",null,"▲","b",null,"b",{"$nulls":5},"コルヒチン錠「タカタ」　０．５ｍｇ"]
["コレアジン錠12.5ｍｇ","アルフレッサ",null,"▲",{"$f":"IF(F195&G195&H195&H195&I195&J195=\"\",\"\",IF(F195&G195&H195&I195=\"\",J195,IF(F195&G195&H195=\"\",I195,(IF(F195&G195=\"\",H195,IF(F195=\"\",G195,F195))))))","v":"b"},null,null,"b",{"$nulls":4},"コレアジン錠12.5ｍｇ"]
["コレバインミニ８３％　１．８１ｇ",{"$nulls":3},"g",null,"g",{"$nulls":5},"コレバインミニ８３％　１．８１ｇ"]
["コロネル錠　５００ｍｇ",null,null,"▲","g",null,"g",{"$nulls":5},"コロネル錠　５００ｍｇ"]
["コントール散１％","武田",null,null,"b","b",{"$nulls":4},"簡易懸濁データなし","単独投与　常温の水で懸濁","コントール散１％"]
["コントミン糖衣錠　１２．５ｍｇ",null,null,"▲","c",null,"c",{"$nulls":5},"コントミン糖衣錠　１２．５ｍｇ"]
["サアミオン錠　５ｍｇ",null,null,"▲","c",null,"c",{"$nulls":5},"サアミオン錠　５ｍｇ"]
["ザイアジェン錠３００ｍｇ","ヴィーブ",null,"×","b",null,"b",{"$nulls":3},"HIV",null,"ザイアジェン錠３００ｍｇ"]
["ザイザル錠５ｍｇ","グラクソ",null,"●","b",null,"b","b",{"$nulls":4},"ザイザル錠５ｍｇ"]
["ザイティガ錠250ｍｇ","ヤンセン",null,"×","g",{"$nulls":3},"g",null,"抗がん剤",null,"ザイティガ錠250ｍｇ"]
["サイトテック錠２００",null,null,"▲","b",null,"b",{"$nulls":5},"サイトテック錠２００"]
["ザイボックス錠６００ｍｇ","ファイザー",null,"×","b",null,"b",{"$nulls":5},"ザイボックス錠６００ｍｇ"]
["サイレース錠１ｍｇ　",null,null,"▲","b",null,"b",{"$nulls":5},"サイレース錠１ｍｇ　"]
["サインバルタカプセル２０ｍｇ","リリー","塩野義","▲","g",null,"g",{"$nulls":3},"腸溶性",null,"サインバルタカプセル２０ｍｇ"]
["ザジテンＤＳ　０．１％","ノバルティスファーマ",null,null,"b",{"$nulls":3},"b",null,"表面に白いものが残る",null,"ザジテンＤＳ　０．１％"]
["サムスカ錠１５ｍｇ","大塚",null,"▲","b",null,null,"b",null,null,"口渇を感じない患者は禁忌（経管投与している状態の患者は意識状態の低下がみられることも多いため注意）",null,"サムスカ錠１５ｍｇ"]
["サムスカ錠7.5ｍｇ","大塚",null,"▲","b",null,null,"b",null,null,"口渇を感じない患者は禁忌（経管投与している状態の患者は意識状態の低下がみられることも多いため注意）",null,"サムスカ錠7.5ｍｇ"]
["サラゾピリン錠　５００ｍｇ",null,null,"▲","b",null,"b",{"$nulls":5},"サラゾピリン錠　５００ｍｇ"]
["ザルティア錠5ｍｇ","リリー",null,"▲","b",null,null,"b",{"$nulls":4},"ザルティア錠5ｍｇ"]
["サレドカプセル１００ｍｇ","藤本製薬",null,"×","b",null,"b",{"$nulls":3},"抗がん剤","単独投与　投与器具は毎回破棄　暴露に注意","サレドカプセル１００ｍｇ"]
["サレドカプセル５０ｍｇ","藤本製薬",null,"×","b",null,"b",{"$nulls":3},"抗がん剤","単独投与　投与器具は毎回破棄　暴露に注意","サレドカプセル５０ｍｇ"]
["サワシリン細粒　１００ｍｇ",{"$nulls":3},"b",null,"b",{"$nulls":5},"サワシリン細粒　１００ｍｇ"]
["酸化マグネシウム「シオエ」","日本新薬","シオエ",null,"b",{"$nulls":3},"b",null,"詰まりやすい　マグラックスへ変更推奨",null,"酸化マグネシウム「シオエ」"]
["ザンタック錠　１５０",null,null,"×","c",null,"c",{"$nulls":3},"直前にコーティング破壊　光による着色・吸湿性あり","◆投与直前に破壊◆　","ザンタック錠　１５０"]
["サンリズムカプセル２５ｍｇ",null,null,"●","b",null,"b",{"$nulls":3},"局所麻酔作用あり、舌のしびれ・食道膨脹のおそれあり",null,"サンリズムカプセル２５ｍｇ"]
["ジアゾキシドカプセル25ｍｇ「ＭＳＤ」","MSD",null,"▲","g",{"$nulls":3},"g",{"$nulls":3},"ジアゾキシドカプセル25ｍｇ「ＭＳＤ」"]
["シーエルセントリ錠125ｍｇ","ヴィーブ",null,"×","b",null,"b",{"$nulls":3},"HIV",null,"シーエルセントリ錠125ｍｇ"]
["ジェイゾロフト錠２５ｍｇ","ファイザー",null,"▲","g",null,null,"g",null,null,"シリンジ内付着",null,"ジェイゾロフト錠２５ｍｇ"]
["ジェニナック錠２００ｍｇ","大正富山",null,"▲","b",null,null,"b",{"$nulls":4},"ジェニナック錠２００ｍｇ"]
["ジオトリフ錠20ｍｇ","ベーリンガー",null,"×","g","g",{"$nulls":4},"抗がん剤/懸濁液の安定性（55℃10ｍｌ10分）はあるがチューブ通過は確認なし/必要時相談",null,"ジオトリフ錠20ｍｇ"]
["ジオトリフ錠30ｍｇ","ベーリンガー",null,"×","g","g",{"$nulls":4},"抗がん剤/懸濁液の安定性（55℃10ｍｌ10分）はあるがチューブ通過は確認なし/必要時相談",null,"ジオトリフ錠30ｍｇ"]
["ジオトリフ錠40ｍｇ","ベーリンガー",null,"×","g","g",{"$nulls":4},"抗がん剤/懸濁液の安定性（55℃10ｍｌ10分）はあるがチューブ通過は確認なし/必要時相談",null,"ジオトリフ錠40ｍｇ"]
["ジオトリフ錠50ｍｇ","ベーリンガー",null,"×","g","g",{"$nulls":4},"抗がん剤/懸濁液の安定性（55℃10ｍｌ10分）はあるがチューブ通過は確認なし/必要時相談",null,"ジオトリフ錠50ｍｇ"]
["ジゴシン１０００倍散　０．１％","中外",null,null,"b",{"$nulls":3},"b",{"$nulls":3},"ジゴシン１０００倍散　０．１％"]
["ジスロマックカプセル小児用１００ｍｇ","ファイザー",null,"▲","g","g",{"$nulls":4},"ジスロマック細粒小児用10%の変更",null,"ジスロマックカプセル小児用１００ｍｇ"]
["ジスロマック細粒　小児用",{"$nulls":3},"b",null,"b",{"$nulls":5},"ジスロマック細粒　小児用"]
["ジスロマック錠２５０ｍｇ　",null,null,"×","b",null,"b",{"$nulls":5},"ジスロマック錠２５０ｍｇ　"]
["シナール配合顆粒　１ｇ",{"$nulls":3},"b",null,"b",{"$nulls":5},"シナール配合顆粒　１ｇ"]
["ジプレキサ錠２．５ｍｇ","リリー",null,"▲","b",{"$nulls":3},"b",{"$nulls":3},"ジプレキサ錠２．５ｍｇ"]
["シプロキサン錠１００ｍｇ",null,null,"▲","b",null,"b",{"$nulls":5},"シプロキサン錠１００ｍｇ"]
["シベノール錠５０ｍｇ　",null,null,"▲","b",null,"b",{"$nulls":5},"シベノール錠５０ｍｇ　"]
["ジャカビ錠5ｍｇ","ノバルティス",null,"×","g","g",{"$nulls":4},"抗がん剤/必要時相談",null,"ジャカビ錠5ｍｇ"]
["ジャヌビア錠　５０ｍｇ",null,null,"●","b",null,null,"b",null,"b",null,null,"ジャヌビア錠　５０ｍｇ"]
["ジルテックドライシロップ1.25%","UCBジャパン",null,null,"b","b",{"$nulls":4},"ジルテック錠は懸濁可/簡易懸濁データなし","単独投与　常温の水で懸濁","ジルテックドライシロップ1.25%"]
["ジルテック錠１０","UCジャパン",null,"●","b",null,"b",{"$nulls":5},"ジルテック錠１０"]
["シングレアチュアブル錠５","MSD",null,"×","g",null,null,"g",null,null,"キプレスと同等、不適",null,"シングレアチュアブル錠５"]
["シングレア細粒４ｍｇ","MSD",null,null,"g",null,"g",{"$nulls":3},"キプレス錠不可のため細粒も不可と考えられる",null,"シングレア細粒４ｍｇ"]
["シングレア錠１０　１０ｍｇ","MSD",null,"▲","g",null,null,"g",null,null,"キプレスと同等、不適",null,"シングレア錠１０　１０ｍｇ"]
["シンセロン錠８ｍｇ","杏林",null,"×","b",{"$nulls":3},"b",{"$nulls":3},"シンセロン錠８ｍｇ"]
["シンメトレル細粒１０％",{"$nulls":3},"b",null,"b",{"$nulls":5},"シンメトレル細粒１０％"]
["シンメトレル錠５０ｍｇ",null,null,"▲","b",null,"b",{"$nulls":5},"シンメトレル錠５０ｍｇ"]
["スーテントカプセル１２．５ｍｇ","ファイザー",null,"×","b",null,"b",{"$nulls":3},"抗がん剤","単独投与　投与器具は毎回破棄　暴露に注意","スーテントカプセル１２．５ｍｇ"]
["スタラシドカプセル５０ｍｇ","日本化薬",null,"×","b",null,"b",{"$nulls":3},"抗がん剤","単独投与　投与器具は毎回破棄　暴露に注意","スタラシドカプセル５０ｍｇ"]
["スタリビルド配合錠","日本たばこ産業",null,"×","b",null,null,"b",null,null,"HIV/常温で","常温の水で懸濁","スタリビルド配合錠"]
["スチバーガ錠40ｍｇ","バイエル",null,"×","g",{"$nulls":3},"g",null,"抗がん剤",null,"スチバーガ錠40ｍｇ"]
["ストックリン錠２００ｍｇ","MSD",null,"×","g",null,"g",{"$nulls":3},"HIV　600mg参照",null,"ストックリン錠２００ｍｇ"]
["ストックリン錠６００ｍｇ","MSD",null,"×","g",null,"g",{"$nulls":3},"HIV",null,"ストックリン錠６００ｍｇ"]
["ストロメクトール錠　３ｍｇ","マルホ","MSD","▲","b",null,"b",{"$nulls":5},"ストロメクトール錠　３ｍｇ"]
["ズファジラン錠10ｍｇ","第一三共",null,"▲","b",null,"b",{"$nulls":5},"ズファジラン錠10ｍｇ"]
["スプリセル錠２０ｍｇ","ブリストルマイヤーズ",null,"×","b",null,"b",{"$nulls":3},"抗がん剤","単独投与　投与器具は毎回破棄　暴露に注意","スプリセル錠２０ｍｇ"]
["スンベプラカプセル100ｍｇ","ブリストルマイヤーズ",null,"×","g",{"$nulls":3},"g",null,"油の液体軟カプセルのため不可",null,"スンベプラカプセル100ｍｇ"]
["セイブル錠　５０ｍｇ","三和化学",null,"▲","c",null,null,"c",{"$nulls":4},"セイブル錠　５０ｍｇ"]
["ゼチーア錠１０ｍｇ","MSD",null,"●","b",{"$nulls":3},"b",null,"原薬は脂溶性",null,"ゼチーア錠１０ｍｇ"]
["セディ－ル錠１０ｍｇ",null,null,"▲","b",null,"b",{"$nulls":5},"セディ－ル錠１０ｍｇ"]
["セパゾン錠２",null,null,"▲","b",null,"b",{"$nulls":5},"セパゾン錠２"]
["セファドール錠　２５ｍｇ　",null,null,"●",{"$f":"IF(F259&G259&H259&H259&I259&J259=\"\",\"\",IF(F259&G259&H259&I259=\"\",J259,IF(F259&G259&H259=\"\",I259,(IF(F259&G259=\"\",H259,IF(F259=\"\",G259,F259))))))","v":"b"},null,"b",{"$nulls":5},"セファドール錠　２５ｍｇ　"]
["セフカペンピボキシル塩酸塩錠100mg「ファイザー」","マイラン",null,"×","b",null,null,"b",null,null,"残留粒子あるが押し込める",null,"セフカペンピボキシル塩酸塩錠100mg「ファイザー」"]
["セフジニル錠100mg「サワイ」","沢井",null,"●","b",null,"b",{"$nulls":5},"セフジニル錠100mg「サワイ」"]
["セフゾン細粒小児用１０％　２００ｇ",{"$nulls":3},"b",null,"b",{"$nulls":5},"セフゾン細粒小児用１０％　２００ｇ"]
["セララ錠２５ｍｇ","ファイザー",null,"●","b",null,"b",{"$nulls":5},"セララ錠２５ｍｇ"]
["ゼリットカプセル　１５ｍｇ","ブリストルマイヤーズ",null,"×","b",null,"b",{"$nulls":3},"HIV",null,"ゼリットカプセル　１５ｍｇ"]
["ゼリットカプセル２０ｍｇ","ブリストルマイヤーズ",null,"×","b",null,"b",{"$nulls":3},"HIV",null,"ゼリットカプセル２０ｍｇ"]
["セルシン錠　２ｍｇ",null,null,"●","b",null,"b",{"$nulls":5},"セルシン錠　２ｍｇ"]
["セルセプトカプセル250ｍｇ","中外",null,"▲","b",null,null,"b",{"$nulls":4},"セルセプトカプセル250ｍｇ"]
["セレキノン錠　１００ｍｇ",null,null,"▲","g",null,"g",{"$nulls":5},"セレキノン錠　１００ｍｇ"]
["セレクト－ル錠２００ｍｇ",null,null,"▲","c",null,"c",{"$nulls":3},"湿度の影響あり","◆投与直前に破壊◆　","セレクト－ル錠２００ｍｇ"]
["セレコックス錠１００ｍｇ","アステラス",null,"●","c",null,null,"c",{"$nulls":4},"セレコックス錠１００ｍｇ"]
["セレジスト錠５ｍｇ",null,null,"▲","b",null,"b",{"$nulls":3},"完全に崩壊しないが通過性問題なし",null,"セレジスト錠５ｍｇ"]
["セレスタミン配合錠",null,null,"▲","b",null,"b",{"$nulls":5},"セレスタミン配合錠"]
["セレニカＲ顆粒　４０％",{"$nulls":3},"g",null,"g",{"$nulls":5},"セレニカＲ顆粒　４０％"]
["セレネース錠　０．７５ｍｇ",null,null,"●","b",null,"b",{"$nulls":5},"セレネース錠　０．７５ｍｇ"]
["ゼローダ錠３００　","中外",null,"×","b",null,"b",{"$nulls":3},"抗がん剤","単独投与　投与器具は毎回破棄　暴露に注意","ゼローダ錠３００　"]
["セロクラール錠　１０ｍｇ","日医工",null,"▲","g",null,null,"g",null,null,"20mg錠のデータ参照",null,"セロクラール錠　１０ｍｇ"]
["セロケン錠２０ｍｇ",null,null,"▲","b",null,"b",{"$nulls":5},"セロケン錠２０ｍｇ"]
["セロトーン錠１０ｍｇ",null,null,"×","b",null,"b",{"$nulls":5},"セロトーン錠１０ｍｇ"]
["センノサイド錠（大正薬品）　１２ｍｇ","大正薬品",null,"●","g",null,null,"g",null,null,"ピコスルファートで代用",null,"センノサイド錠（大正薬品）　１２ｍｇ"]
["ソセゴン錠２５ｍｇ","丸石",null,"×","b",null,null,"b",null,null,"向精神薬2種 ソセゴン注あり",null,"ソセゴン錠２５ｍｇ"]
["ソタコール錠４０ｍｇ","ブリストルマイヤーズ",null,"▲",{"$f":"IF(F281&G281&H281&H281&I281&J281=\"\",\"\",IF(F281&G281&H281&I281=\"\",J281,IF(F281&G281&H281=\"\",I281,(IF(F281&G281=\"\",H281,IF(F281=\"\",G281,F281))))))","v":"b"},null,null,"b",{"$nulls":4},"ソタコール錠４０ｍｇ"]
["ゾビラックス錠　２００ｍｇ",null,null,"▲","b",null,"b",{"$nulls":5},"ゾビラックス錠　２００ｍｇ"]
["ソブリアードカプセル100ｍｇ","ヤンセン",null,"×","g",{"$nulls":3},"g",null,"データなし　症例あった時に要相談",null,"ソブリアードカプセル100ｍｇ"]
["ソラナックス０．４ｍｇ錠",null,null,"●","b",null,"b",{"$nulls":5},"ソラナックス０．４ｍｇ錠"]
["ソランタール錠１００ｍｇ",null,null,"▲","c",null,"c",{"$nulls":5},"ソランタール錠１００ｍｇ"]
["ゾルピデム酒石酸塩OD錠5mg「サワイ」","沢井",null,"●","b",null,"b",{"$nulls":5},"ゾルピデム酒石酸塩OD錠5mg「サワイ」"]
["ダイアート錠６０ｍｇ",null,null,"●","b",null,"b",{"$nulls":5},"ダイアート錠６０ｍｇ"]
["ダイアモックス錠２５０ｍｇ",null,null,"▲","b",null,"b",{"$nulls":5},"ダイアモックス錠２５０ｍｇ"]
["タイケルブ錠　２５０ｍｇ","グラクソ",null,"×","b",null,"b","b",null,null,"抗がん剤","単独投与　投与器具は毎回破棄　暴露に注意","タイケルブ錠　２５０ｍｇ"]
["タウリン散９８％「大正」",{"$nulls":3},"b",null,"b",{"$nulls":3},"溶けないため振り混ぜながら注入",null,"タウリン散９８％「大正」"]
["ダグルインザ錠60ｍｇ","ブリストルマイヤーズ",null,"×","g",{"$nulls":3},"g",{"$nulls":3},"ダグルインザ錠60ｍｇ"]
["タシグナカプセル１５０ｍｇ","ノバルティス",null,"×","b",null,"b",{"$nulls":3},"抗がん剤","単独投与　投与器具は毎回破棄　暴露に注意","タシグナカプセル１５０ｍｇ"]
["タシグナカプセル２００ｍｇ","ノバルティス",null,"×","b",null,"b",{"$nulls":3},"抗がん剤","単独投与　投与器具は毎回破棄　暴露に注意","タシグナカプセル２００ｍｇ"]
["タナド－パ顆粒　１ｇ",{"$nulls":3},"g",null,"g",{"$nulls":5},"タナド－パ顆粒　１ｇ"]
["タナトリル錠５",null,null,"●","c",null,"c",{"$nulls":5},"タナトリル錠５"]
["タミフルカプセル７５ｍｇ",null,null,"×","b",null,"b",{"$nulls":5},"タミフルカプセル７５ｍｇ"]
["タミフルドライシロップ３％","中外",null,null,"b",{"$nulls":3},"b",{"$nulls":3},"タミフルドライシロップ３％"]
["ダラシンカプセル　１５０ｍｇ",null,null,"●","b",null,"b",{"$nulls":5},"ダラシンカプセル　１５０ｍｇ"]
["タリオン錠１０　１０ｍｇ","田辺三菱",null,"●","g",null,null,"g",{"$nulls":4},"タリオン錠１０　１０ｍｇ"]
["タルセバ錠１００ｍｇ","中外",null,"×","b",null,"b",{"$nulls":3},"抗がん剤","単独投与　投与器具は毎回破棄　暴露に注意","タルセバ錠１００ｍｇ"]
["タルセバ錠１５０ｍｇ","中外",null,"×","b",null,"b",{"$nulls":3},"抗がん剤","単独投与　投与器具は毎回破棄　暴露に注意","タルセバ錠１５０ｍｇ"]
["タルセバ錠２５ｍｇ","中外",null,"×","b",null,"b",{"$nulls":3},"抗がん剤","単独投与　投与器具は毎回破棄　暴露に注意","タルセバ錠２５ｍｇ"]
["ダントリウムカプセル２５",null,null,"▲","b",null,"b",{"$nulls":5},"ダントリウムカプセル２５"]
["タンニン酸アルブミン","日本新薬","シオエ",null,"b",null,null,"b",null,null,"55℃では凝固するため常温の水で懸濁","常温の水で懸濁","タンニン酸アルブミン"]
["タンボコ－ル錠　５０ｍｇ",null,null,"▲","b",null,"b",{"$nulls":5},"タンボコ－ル錠　５０ｍｇ"]
["チザニジン錠1mg「サワイ」","沢井",null,"▲","b",null,"b",{"$nulls":5},"チザニジン錠1mg「サワイ」"]
["チャンピックス錠０．５ｍｇ","ファイザー",null,"×","b",null,null,"b",null,null,"フラッシュ120ｍｌ必要（ガストロは詰まるかも）","多めの水でフラッシュ","チャンピックス錠０．５ｍｇ"]
["チャンピックス錠１ｍｇ","ファイザー",null,"×","b",null,null,"b",null,null,"フラッシュ120ｍｌ必要（ガストロは詰まるかも）","多めの水でフラッシュ","チャンピックス錠１ｍｇ"]
["チラ－ヂンＳ錠５０",null,null,"●","c",null,"c",{"$nulls":5},"チラ－ヂンＳ錠５０"]
["チロナミン錠　５μｇ",null,null,"●","b",null,"b",{"$nulls":3},"25μg参照",null,"チロナミン錠　５μｇ"]
["ツムラ葛根湯エキス顆粒（医療用）",{"$nulls":3},"b",null,"b",{"$nulls":5},"ツムラ葛根湯エキス顆粒（医療用）"]
["ツムラ五苓散エキス顆粒（医療用）",{"$nulls":3},"b",null,"b",{"$nulls":5},"ツムラ五苓散エキス顆粒（医療用）"]
["ツムラ清心蓮子飲エキス顆粒",{"$nulls":3},"b",null,"b",{"$nulls":5},"ツムラ清心蓮子飲エキス顆粒"]
["ツムラ大建中湯エキス顆粒",{"$nulls":3},"b",null,"b",{"$nulls":5},"ツムラ大建中湯エキス顆粒"]
["ツムラ猪苓湯エキス顆粒",{"$nulls":3},"b",null,"b",{"$nulls":5},"ツムラ猪苓湯エキス顆粒"]
["ツムラ麦門冬湯エキス顆粒",{"$nulls":3},"b",null,"b",{"$nulls":5},"ツムラ麦門冬湯エキス顆粒"]
["ツムラ八味地黄丸エキス顆粒（医療用）",{"$nulls":3},"b",null,"b",{"$nulls":5},"ツムラ八味地黄丸エキス顆粒（医療用）"]
["ツムラ半夏瀉心湯エキス",{"$nulls":3},"b",null,"b",{"$nulls":5},"ツムラ半夏瀉心湯エキス"]
["ツムラ補中益気湯エキス顆粒",{"$nulls":3},"b",null,"b",{"$nulls":5},"ツムラ補中益気湯エキス顆粒"]
["ツムラ抑肝散エキス顆粒（２．５ｇ/包）",{"$nulls":3},"b",null,"b",{"$nulls":5},"ツムラ抑肝散エキス顆粒（２．５ｇ/包）"]
["ツムラ六君子湯エキス顆粒　１８９包",{"$nulls":3},"b",null,"b",{"$nulls":5},"ツムラ六君子湯エキス顆粒　１８９包"]
["ティーエスワン配合OD錠T20","大鵬薬品",null,"×","b",null,null,"b",null,null,"抗がん剤","単独投与　投与器具は毎回破棄　暴露に注意","ティーエスワン配合OD錠T20"]
["ティーエスワン配合OD錠T25","大鵬薬品",null,"×","b",null,null,"b",null,null,"抗がん剤","単独投与　投与器具は毎回破棄　暴露に注意","ティーエスワン配合OD錠T25"]
["ティ－エスワン配合顆粒T２０",{"$nulls":3},"b",null,"b",{"$nulls":3},"抗がん剤","単独投与　投与器具は毎回破棄　暴露に注意","ティ－エスワン配合顆粒T２０"]
["ティ－エスワン配合顆粒T２５","大鵬",null,null,"b",null,null,"b",{"$nulls":4},"ティ－エスワン配合顆粒T２５"]
["テオドールドライシロップ20%","田辺三菱",null,null,"b","b",null,"g",null,null,"常温の水5mLに溶解して4Fr.通過したデータあり　溶解すると徐放の剤形が崩れてくるため懸濁してなるべく早く投与","単独投与　常温の水で懸濁し10分待たずにすぐに注入","テオドールドライシロップ20%"]
["テオロング錠１００ｍｇ",null,null,"●","g",null,"g",{"$nulls":3},"徐放性",null,"テオロング錠１００ｍｇ"]
["テオロング錠２００ｍｇ",null,null,"▲","g",null,"g",{"$nulls":3},"徐放性",null,"テオロング錠２００ｍｇ"]
["デカドロン錠　０．５ｍｇ",null,null,"▲","b",null,"b",{"$nulls":5},"デカドロン錠　０．５ｍｇ"]
["テグレトール細粒　５０％",{"$nulls":3},"b",null,"b",{"$nulls":3},"多めの水でフラッシュ","多めの水でフラッシュ","テグレトール細粒　５０％"]
["テグレトール錠　２００ｍｇ",null,null,"●","b",null,"b",{"$nulls":5},"テグレトール錠　２００ｍｇ"]
["テシプール錠　１ｍｇ",null,null,"▲","b",null,"b",{"$nulls":5},"テシプール錠　１ｍｇ"]
["デジレル錠２５",null,null,"▲","c",null,"c",{"$nulls":3},"50mg参照",null,"デジレル錠２５"]
["テネリア錠20ｍｇ","田辺",null,"▲","c",null,null,"c",{"$nulls":4},"テネリア錠20ｍｇ"]
["テノーミン　５０ｍｇ",null,null,"▲","b",null,"b",{"$nulls":5},"テノーミン　５０ｍｇ"]
["テノゼット錠300ｍｇ","グラクソ",null,"▲","b",null,null,"b",{"$nulls":4},"テノゼット錠300ｍｇ"]
["デノタスチュアブル配合錠","第一三共",null,"×","c",null,null,"c",null,null,"55℃20mL20回以上破壊して10分で懸濁可","しっかり破壊（20回以上たたく）","デノタスチュアブル配合錠"]
["デパケンＲ錠１００",null,null,"▲","g",null,"g",{"$nulls":3},"徐放性",null,"デパケンＲ錠１００"]
["デパケンＲ錠２００",null,null,"●","g",null,"g",{"$nulls":3},"徐放性",null,"デパケンＲ錠２００"]
["テビケイ錠50ｍｇ","ヴィーブ",null,"×","g","g",{"$nulls":4},"HIV/データないが簡易懸濁必要ないと思われる",null,"テビケイ錠50ｍｇ"]
["テプレノンカプセル50ｍｇ「トーワ」","東和",null,"●","b",null,"b",{"$nulls":5},"テプレノンカプセル50ｍｇ「トーワ」"]
["テモカプリル塩酸塩錠２ｍｇ「タカタ」","高田",null,"●","b",null,"b",{"$nulls":5},"テモカプリル塩酸塩錠２ｍｇ「タカタ」"]
["テモダールカプセル１００ｍｇ","MSD",null,"×","b",null,"b",{"$nulls":3},"抗がん剤","単独投与　投与器具は毎回破棄　暴露に注意","テモダールカプセル１００ｍｇ"]
["テモダールカプセル２０ｍｇ","MSD",null,"×","b",null,"b",{"$nulls":3},"抗がん剤","単独投与　投与器具は毎回破棄　暴露に注意","テモダールカプセル２０ｍｇ"]
["ドグマチール錠５０ｍｇ",null,null,"●",{"$f":"IF(F345&G345&H345&H345&I345&J345=\"\",\"\",IF(F345&G345&H345&I345=\"\",J345,IF(F345&G345&H345=\"\",I345,(IF(F345&G345=\"\",H345,IF(F345=\"\",G345,F345))))))","v":"b"},null,"b",{"$nulls":3},"100mg参照",null,"ドグマチール錠５０ｍｇ"]
["ドパストン散９８．５％",{"$nulls":3},"b",null,"b",{"$nulls":3},"ドパミン製剤のため酸化マグネシウムと同時懸濁しない","酸化ﾏｸﾞﾈｼｳﾑ(ﾏｸﾞﾗｯｸｽ等)と同時懸濁しない","ドパストン散９８．５％"]
["トビエース錠4ｍｇ","ファイザー",null,"×","g",null,null,"g",null,null,"徐放",null,"トビエース錠4ｍｇ"]
["トピナ細粒１０％","協和発酵キリン",null,null,"b",null,null,"b",{"$nulls":4},"トピナ細粒１０％"]
["トピナ錠５０ｍｇ","協和発酵キリン",null,"▲","b",null,null,"b",{"$nulls":4},"トピナ錠５０ｍｇ"]
["ドプスOD錠２００ｍｇ","大日本住友",null,"●","b",null,null,"b",null,null,"ドパミン製剤のため酸化マグネシウムと同時懸濁しない","酸化ﾏｸﾞﾈｼｳﾑ(ﾏｸﾞﾗｯｸｽ等)と同時懸濁しない","ドプスOD錠２００ｍｇ"]
["ドプス細粒　２０％","大日本住友",null,null,"g","g",{"$nulls":4},"OD錠に変更",null,"ドプス細粒　２０％"]
["トフラニール錠１０ｍｇ",null,null,"▲","g",null,"g",{"$nulls":5},"トフラニール錠１０ｍｇ"]
["ドミン錠",null,null,"▲","b",null,"b",{"$nulls":5},"ドミン錠"]
["トラクリア錠６２．５ｍｇ","アクテリオンファーマ",null,"▲","b",null,null,"b",{"$nulls":4},"トラクリア錠６２．５ｍｇ"]
["トラゼンタ錠5ｍｇ","ベーリンガー",null,"▲","b",{"$nulls":3},"b",{"$nulls":3},"トラゼンタ錠5ｍｇ"]
["トラベルミン配合錠",null,null,"●","c",null,"c",{"$nulls":5},"トラベルミン配合錠"]
["トラマールOD錠２５ｍｇ","ファイザー",null,"●","b",null,null,"b",{"$nulls":4},"トラマールOD錠２５ｍｇ"]
["トラムセット配合錠","持田製薬","ヤンセン","●","b",{"$nulls":3},"b",{"$nulls":3},"トラムセット配合錠"]
["ドラ－ル錠１５　１５ｍｇ",null,null,"▲","b",null,"b",{"$nulls":5},"ドラ－ル錠１５　１５ｍｇ"]
["トランサミンカプセル　２５０ｍｇ",null,null,"●","b",null,"b",{"$nulls":5},"トランサミンカプセル　２５０ｍｇ"]
["トリアゾラム錠０．１２５ｍｇ「テバ」","テバ",null,"●","b",null,"b",{"$nulls":5},"トリアゾラム錠０．１２５ｍｇ「テバ」"]
["トリプタノ－ル錠　１０ｍｇ",null,null,"●","b",null,"b",{"$nulls":5},"トリプタノ－ル錠　１０ｍｇ"]
["トレドミン錠２５　２５ｍｇ",null,null,"▲","b",null,"b",{"$nulls":5},"トレドミン錠２５　２５ｍｇ"]
["トロペロン錠1ｍｇ",null,null,"▲","b",null,"b",{"$nulls":5},"トロペロン錠1ｍｇ"]
["ドンペリドン錠１０ｍｇ　「ＥＭＥＣ」",null,null,"●","b",null,"b",{"$nulls":5},"ドンペリドン錠１０ｍｇ　「ＥＭＥＣ」"]
["ナイキサン錠　１００ｍｇ",null,null,"●","b",null,"b",{"$nulls":5},"ナイキサン錠　１００ｍｇ"]
["ナウゼリンドライシロップ1%","協和発酵キリン",null,null,"b","b",{"$nulls":4},"ドンペリドン錠は懸濁可　坐剤あり/簡易懸濁データなし","単独投与　常温の水で懸濁","ナウゼリンドライシロップ1%"]
["ニコチン酸アミド散ゾンネ　１０％",{"$nulls":3},"b",null,"b",{"$nulls":5},"ニコチン酸アミド散ゾンネ　１０％"]
["ニコランジル錠5mg「日医工」","日医工",null,"●","b",null,"b",{"$nulls":5},"ニコランジル錠5mg「日医工」"]
["ニッパスカルシウム顆粒１００％","田辺三菱",null,null,"g","g",{"$nulls":4},"必要時相談",null,"ニッパスカルシウム顆粒１００％"]
["ニトロール錠　５ｍｇ",null,null,"▲","b",null,"b",{"$nulls":5},"ニトロール錠　５ｍｇ"]
["ニトロペン舌下錠　０．３ｍｇ","日本化薬",null,"×","g","g",{"$nulls":4},"特殊",null,"ニトロペン舌下錠　０．３ｍｇ"]
["ニバジール錠２ｍｇ",null,null,"▲","b",null,"b",{"$nulls":3},"4mg参照",null,"ニバジール錠２ｍｇ"]
["ニフェジピンCR錠２０ｍｇ「日医工」","日医工",null,"●","g","g",{"$nulls":4},"徐放",null,"ニフェジピンCR錠２０ｍｇ「日医工」"]
["ニポラジン錠　３ｍｇ　",null,null,"▲","b",null,"b",{"$nulls":5},"ニポラジン錠　３ｍｇ　"]
["ニュ－ロタン錠　５０ｍｇ",null,null,"●","c",null,"c",{"$nulls":5},"ニュ－ロタン錠　５０ｍｇ"]
["ネオマレルミンＴＲ錠6ｍｇ","テバ",null,"●","g",null,"g",{"$nulls":3},"腸溶性",null,"ネオマレルミンＴＲ錠6ｍｇ"]
["ネオ－ラル２５ｍｇ",null,null,"×","b",null,"b",{"$nulls":3},"ネオーラル内用液への変更を推奨",null,"ネオ－ラル２５ｍｇ"]
["ネキシウムカプセル２０ｍｇ",null,null,"●","b",null,"b",{"$nulls":5},"ネキシウムカプセル２０ｍｇ"]
["ネクサバール錠２００ｍｇ","バイエル",null,"×","g",null,"g",{"$nulls":3},"抗がん剤/懸濁はするがチューブ閉塞",null,"ネクサバール錠２００ｍｇ"]
["ネシーナ錠　１２．５ｍｇ","武田",null,"●","c",null,null,"c",{"$nulls":4},"ネシーナ錠　１２．５ｍｇ"]
["ノイエルカプセル　２００ｍｇ",null,null,"●","b",null,"b",{"$nulls":5},"ノイエルカプセル　２００ｍｇ"]
["ノイキノン錠１０ｍｇ　",null,null,"●","b",null,"b",{"$nulls":5},"ノイキノン錠１０ｍｇ　"]
["ノイロトロピン錠　４単位　",null,null,"▲","g",null,"g",{"$nulls":5},"ノイロトロピン錠　４単位　"]
["ノウリアスト錠20ｍｇ","協和発酵キリン",null,"▲","b",null,null,"b",null,null,"光に不安定",null,"ノウリアスト錠20ｍｇ"]
["ノバミン錠５ｍｇ",null,null,"●","b",null,"b",{"$nulls":5},"ノバミン錠５ｍｇ"]
["ノ－ビア錠１００ｍｇ","アッヴィ",null,"×","g",null,null,"g",null,null,"HIV　カレトラ粉砕によりリトナビルのAUCが39%低下したため不適",null,"ノ－ビア錠１００ｍｇ"]
["ノルバデックス錠２０ｍｇ",null,null,"×","b",null,"b",{"$nulls":3},"抗がん剤","単独投与　投与器具は毎回破棄　暴露に注意","ノルバデックス錠２０ｍｇ"]
["パーロデル２．５ｍｇ",null,null,"▲","g",null,"g",{"$nulls":5},"パーロデル２．５ｍｇ"]
["バイアスピリン",null,null,"●","c",null,"c",{"$nulls":3},"破壊すると腸溶でなくなるのでアスピリンへ変更を推奨",null,"バイアスピリン"]
["バイカロン錠　２５ｍｇ",null,null,"▲","b",null,"b",{"$nulls":5},"バイカロン錠　２５ｍｇ"]
["バイシリンＧ顆粒４０万単位",{"$nulls":3},"b",null,"b",{"$nulls":5},"バイシリンＧ顆粒４０万単位"]
["ハイドレアカプセル",null,null,"×","b",null,"b",{"$nulls":3},"抗がん剤","単独投与　投与器具は毎回破棄　暴露に注意","ハイドレアカプセル"]
["ハイペン錠200ｍｇ　",null,null,"●","b",null,"b",{"$nulls":5},"ハイペン錠200ｍｇ　"]
["パキシルCR錠12.5ｍｇ","グラクソ",null,"▲","g",null,null,"g",{"$nulls":4},"パキシルCR錠12.5ｍｇ"]
["バクタ配合錠",null,null,"●","b",null,"b",{"$nulls":5},"バクタ配合錠"]
["バップフォ－錠10ｍｇ",null,null,"▲","b",null,"b",{"$nulls":5},"バップフォ－錠10ｍｇ"]
["パナルジン錠100ｍｇ",null,null,"▲","c",null,"c",{"$nulls":5},"パナルジン錠100ｍｇ"]
["バファリン配合錠Ａ330",null,null,"×","b",null,"b",{"$nulls":5},"バファリン配合錠Ａ330"]
["バラクルード錠０．５ｍｇ","ブリストルマイヤーズ",null,"×","b",null,null,"b",{"$nulls":4},"バラクルード錠０．５ｍｇ"]
["バルサルタン錠80ｍｇ「サンド」","サンド",null,"●","b",null,null,"b",{"$nulls":4},"バルサルタン錠80ｍｇ「サンド」"]
["バルトレックス錠500ｍｇ","グラクソ",null,"▲","c",null,"c",{"$nulls":5},"バルトレックス錠500ｍｇ"]
["バルトレックス顆粒５０％","グラクソ",null,null,"g",null,null,"g",{"$nulls":4},"バルトレックス顆粒５０％"]
["ハルナールＤ錠0.2ｍｇ",null,null,"●","b",null,"b",{"$nulls":5},"ハルナールＤ錠0.2ｍｇ"]
["バレイショデンプン","日本新薬","シオエ",null,"b",{"$nulls":4},"b","他メーカーのものではハンドブックで懸濁可",null,"バレイショデンプン"]
["パントシン錠100",null,null,"▲","g",null,"g",{"$nulls":5},"パントシン錠100"]
["ビ・シフロール錠0.125ｍｇ","ブリストルマイヤーズ",null,"▲","b",{"$nulls":3},"b",{"$nulls":3},"ビ・シフロール錠0.125ｍｇ"]
["ビ・シフロール錠0.5ｍｇ","ブリストルマイヤーズ",null,"▲","b",{"$nulls":3},"b",{"$nulls":3},"ビ・シフロール錠0.5ｍｇ"]
["ビソルボン細粒　２％",{"$nulls":3},{"$f":"IF(F409&G409&H409&H409&I409&J409=\"\",\"\",IF(F409&G409&H409&I409=\"\",J409,IF(F409&G409&H409=\"\",I409,(IF(F409&G409=\"\",H409,IF(F409=\"\",G409,F409))))))","v":"b"},null,"b",{"$nulls":5},"ビソルボン細粒　２％"]
["ビソルボン錠　４ｍｇ",null,null,"●","b",null,"b",{"$nulls":5},"ビソルボン錠　４ｍｇ"]
["ビタメジン配合カプセルＢ２５",null,null,"●","b",null,"b",{"$nulls":5},"ビタメジン配合カプセルＢ２５"]
["ヒダントール錠２５ｍｇ",null,null,"▲","b",null,"b",{"$nulls":5},"ヒダントール錠２５ｍｇ"]
["ピドキサール錠　１０ｍｇ","中外",null,"●","g",null,"g",{"$nulls":5},"ピドキサール錠　１０ｍｇ"]
["ビビアント錠２０ｍｇ　","ファイザー",null,"▲","b",{"$nulls":3},"b",{"$nulls":3},"ビビアント錠２０ｍｇ　"]
["ビブラマイシン錠　１００ｍｇ",null,null,"▲","g",null,"g",{"$nulls":5},"ビブラマイシン錠　１００ｍｇ"]
["ピラマイド",{"$nulls":3},"b",null,"b",{"$nulls":5},"ピラマイド"]
["ビリアード錠３００ｍｇ","日本たばこ",null,"×","b",null,"b",{"$nulls":3},"HIV",null,"ビリアード錠３００ｍｇ"]
["ビルトリシド錠600ｍｇ","バイエル",null,"×","b",null,"b",{"$nulls":5},"ビルトリシド錠600ｍｇ"]
["ヒルナミン細粒１０％",{"$nulls":3},"b",null,"b",{"$nulls":3},"ゆっくり注入","ゆっくり注入","ヒルナミン細粒１０％"]
["ピレスパ錠２００ｍｇ","塩野義",null,"▲","b",null,"b",{"$nulls":5},"ピレスパ錠２００ｍｇ"]
["ファスティック錠９０ｍｇ",null,null,"×","b",null,"b",{"$nulls":5},"ファスティック錠９０ｍｇ"]
["ファモチジンＤ錠20ｍｇ「サワイ」",null,null,"●","b",null,"b",{"$nulls":5},"ファモチジンＤ錠20ｍｇ「サワイ」"]
["ファロム錠200ｍｇ",null,null,"▲","g",null,"g",{"$nulls":5},"ファロム錠200ｍｇ"]
["ブイフェンド錠５０ｍｇ","ファイザー",null,"×","b",null,"b",{"$nulls":5},"ブイフェンド錠５０ｍｇ"]
["フェアストン錠　４０ｍｇ",null,null,"×","b",null,"b",{"$nulls":3},"抗がん剤","単独投与　投与器具は毎回破棄　暴露に注意","フェアストン錠　４０ｍｇ"]
["フェキソフェナジン塩酸塩錠６０ｍｇ「SANIK」","日医工サノフィー",null,"●","g",null,null,"g",{"$nulls":4},"フェキソフェナジン塩酸塩錠６０ｍｇ「SANIK」"]
["フェネルミン錠50mg","小林化工",null,"●","c",null,null,"c",{"$nulls":4},"フェネルミン錠50mg"]
["フェノバール散　１０％","第一三共","藤永",null,"b",null,null,"b",{"$nulls":4},"フェノバール散　１０％"]
["フェノバール錠３０ｍｇ","藤永",null,"▲","b",null,"b",{"$nulls":5},"フェノバール錠３０ｍｇ"]
["フェブリク錠２０ｍｇ","帝人ファーマ",null,"●","b",null,"b",{"$nulls":5},"フェブリク錠２０ｍｇ"]
["フェマーラ錠　２．５ｍｇ","ノバルティス",null,"×","b",null,"b",{"$nulls":3},"抗がん剤","単独投与　投与器具は毎回破棄　暴露に注意","フェマーラ錠　２．５ｍｇ"]
["フェロ・グラデュメット錠１０５ｍｇ　",null,null,"●","g",null,"g",{"$nulls":3},"多孔性プラスチック",null,"フェロ・グラデュメット錠１０５ｍｇ　"]
["フェロベリン錠","MSD",null,"▲","b",null,"b",{"$nulls":5},"フェロベリン錠"]
["フオイパン錠　１００ｍｇ",null,null,"●","b",null,"b",{"$nulls":5},"フオイパン錠　１００ｍｇ"]
["フォサマック錠３５ｍｇ","MSD",null,"×","b",null,null,"b",null,null,"特殊","50mLの55℃温湯で溶解　頭部挙上状態で投与","フォサマック錠３５ｍｇ"]
["フォスブロック錠２５０ｍｇ","協和発酵キリン",null,"●","g",null,null,"g",null,null,"吸湿性で膨脹",null,"フォスブロック錠２５０ｍｇ"]
["フォリアミン錠　５ｍｇ",null,null,"▲","b",null,"b",{"$nulls":5},"フォリアミン錠　５ｍｇ"]
["ブスコパン錠　１０ｍｇ",null,null,"▲","b",null,"b",{"$nulls":5},"ブスコパン錠　１０ｍｇ"]
["プラザキサカプセル　１１０ｍｇ","ベーリンガー",null,"×","g",null,null,"g",null,null,"脱カプセルでAUC上昇",null,"プラザキサカプセル　１１０ｍｇ"]
["プラザキサカプセル　７５ｍｇ","ベーリンガー",null,"×","g",null,null,"g",null,null,"脱カプセルでAUC上昇",null,"プラザキサカプセル　７５ｍｇ"]
["フラジール内服錠　２５０ｍｇ",null,null,"●","g",null,"g",{"$nulls":5},"フラジール内服錠　２５０ｍｇ"]
["ブラダロン錠２００ｍｇ",null,null,"▲","b",null,"b",{"$nulls":5},"ブラダロン錠２００ｍｇ"]
["プラノバール",null,null,"▲","b",null,"b",{"$nulls":5},"プラノバール"]
["プラビックス錠２５ｍｇ","サノフィ",null,"▲","c",null,"c",{"$nulls":5},"プラビックス錠２５ｍｇ"]
["プラビックス錠７５ｍｇ","サノフィ",null,"●","c",null,"c",{"$nulls":5},"プラビックス錠７５ｍｇ"]
["プランルカスト錠１１２．５ｍｇ　「ＥＫ」","小林化工",null,"●","b",null,null,"b",null,null,"多めの水でフラッシュ","多めの水でフラッシュ","プランルカスト錠１１２．５ｍｇ　「ＥＫ」"]
["プリジスタナイーブ錠800ｍｇ","ヤンセン",null,"×","b",{"$nulls":3},"b",null,"HIV",null,"プリジスタナイーブ錠800ｍｇ"]
["フリバスＯＤ錠２５ｍｇ　",null,null,"●","b",null,"b",{"$nulls":5},"フリバスＯＤ錠２５ｍｇ　"]
["プリモボラン錠５ｍｇ",null,null,"▲","b",null,"b",{"$nulls":5},"プリモボラン錠５ｍｇ"]
["プリンペラン錠　５ｍｇ",null,null,"●","b",null,"b",{"$nulls":5},"プリンペラン錠　５ｍｇ"]
["フルイトラン錠２ｍｇ",null,null,"●","b",null,"b",{"$nulls":5},"フルイトラン錠２ｍｇ"]
["フルコナゾールカプセル１００ｍｇ「サワイ」","沢井",null,"●","b",null,"b",{"$nulls":5},"フルコナゾールカプセル１００ｍｇ「サワイ」"]
["フルダラ錠１０ｍｇ","サノフィ",null,"×","b",null,"b",{"$nulls":3},"抗がん剤（フルダラ静注あり）","単独投与　投与器具は毎回破棄　暴露に注意","フルダラ錠１０ｍｇ"]
["フルバスタチン錠30mg「サワイ」","沢井",null,"●","b",null,"b",{"$nulls":5},"フルバスタチン錠30mg「サワイ」"]
["プレタールＯＤ錠　１００ｍｇ","大塚",null,"●","b",null,"b",{"$nulls":5},"プレタールＯＤ錠　１００ｍｇ"]
["ブレディニン錠　５０ｍｇ",null,null,"●","b",null,"b",{"$nulls":3},"残渣あるがフラッシュで通過",null,"ブレディニン錠　５０ｍｇ"]
["プレドニゾロン散「タケダ」　１％",{"$nulls":3},"b",null,"b",{"$nulls":5},"プレドニゾロン散「タケダ」　１％"]
["プレドニゾロン錠１ｍｇ（旭化成）",null,null,"●","b",null,"b",{"$nulls":5},"プレドニゾロン錠１ｍｇ（旭化成）"]
["プレドニン錠５ｍｇ",null,null,"●","b",null,"b",{"$nulls":5},"プレドニン錠５ｍｇ"]
["プレマリン錠０．６２５ｍｇ",null,null,"▲","g",null,"g",{"$nulls":5},"プレマリン錠０．６２５ｍｇ"]
["プレミネント配合錠ＬＤ","MSD",null,"●","c",{"$nulls":3},"c",{"$nulls":3},"プレミネント配合錠ＬＤ"]
["プログラフカプセル０．５ｍｇ","アステラス",null,"▲","b",{"$nulls":3},"b",{"$nulls":3},"プログラフカプセル０．５ｍｇ"]
["プログラフカプセル１ｍｇ",null,null,"▲","b",null,"b",{"$nulls":5},"プログラフカプセル１ｍｇ"]
["プロサイリン錠２０",null,null,"●","b",null,"b",{"$nulls":5},"プロサイリン錠２０"]
["プロスタ－ル錠２５　２５ｍｇ",null,null,"▲","b",null,"b",{"$nulls":5},"プロスタ－ル錠２５　２５ｍｇ"]
["プロセキソール錠　０．５ｍｇ","あすか",null,"×","g",null,null,"g",null,null,"抗がん剤/10分経過後も変化なし",null,"プロセキソール錠　０．５ｍｇ"]
["プロパジール錠　５０ｍｇ","中外",null,"▲","g",null,null,"g",null,null,"55℃20mL20分放置して多めの水でフラッシュすれば懸濁可",null,"プロパジール錠　５０ｍｇ"]
["ブロバリン","日本新薬",null,null,"g",{"$nulls":3},"g",null,"シリンジ内に残る",null,"ブロバリン"]
["フロベン錠　４０ｍｇ",null,null,"▲","b",null,"b",{"$nulls":5},"フロベン錠　４０ｍｇ"]
["プロマックＤ錠７５",null,null,"×","b",null,"b",{"$nulls":5},"プロマックＤ錠７５"]
["フロモックス小児用細粒１００ｍｇ",{"$nulls":3},"b",null,"b",{"$nulls":5},"フロモックス小児用細粒１００ｍｇ"]
["フロリネフ錠　０．１ｍｇ",null,null,"●","b",null,"b",{"$nulls":5},"フロリネフ錠　０．１ｍｇ"]
["ベイスンＯＤ錠０．３",null,null,"●",{"$f":"IF(F473&G473&H473&H473&I473&J473=\"\",\"\",IF(F473&G473&H473&I473=\"\",J473,IF(F473&G473&H473=\"\",I473,(IF(F473&G473=\"\",H473,IF(F473=\"\",G473,F473))))))","v":"b"},null,"b",{"$nulls":5},"ベイスンＯＤ錠０．３"]
["ベゲタミンーＡ配合錠",null,null,"▲","g",null,"g",{"$nulls":5},"ベゲタミンーＡ配合錠"]
["ベゲタミンーＢ配合錠",null,null,"▲","g",null,"g",{"$nulls":5},"ベゲタミンーＢ配合錠"]
["ベサコリン散　５％",{"$nulls":3},"b",null,"b",{"$nulls":5},"ベサコリン散　５％"]
["ベザトールＳＲ錠２００ｍｇ",null,null,"●","g",null,"g",{"$nulls":3},"徐放",null,"ベザトールＳＲ錠２００ｍｇ"]
["ベサノイドカプセル　１０ｍｇ",null,null,"×","b",null,"b",{"$nulls":3},"抗がん剤","単独投与　投与器具は毎回破棄　暴露に注意","ベサノイドカプセル　１０ｍｇ"]
["ベシケアＯＤ錠２．５ｍｇ","アステラス",null,"▲","g",null,null,"g",null,null,"有効成分をコーティングしてるものが沈殿しシリンジ内に残留粒子あり",null,"ベシケアＯＤ錠２．５ｍｇ"]
["ベシケアＯＤ錠５ｍｇ","アステラス",null,"●","g",null,null,"g",null,null,"有効成分をコーティングしてるものが沈殿しシリンジ内に残留粒子あり",null,"ベシケアＯＤ錠５ｍｇ"]
["ベタナミン錠１０ｍｇ","三和化学",null,"▲","b",null,null,"b",{"$nulls":4},"ベタナミン錠１０ｍｇ"]
["ベタニス錠５０ｍｇ","アステラス",null,"▲","g",null,null,"g",null,null,"徐放剤",null,"ベタニス錠５０ｍｇ"]
["ベプシドＳ２５　２５ｍｇ","ブリストルマイヤーズ",null,"×","g",null,null,"g",null,null,"抗がん剤（カプセルがシリンジに付着）",null,"ベプシドＳ２５　２５ｍｇ"]
["ヘプセラ錠１０","グラクソ",null,"×","b",null,"b","b",{"$nulls":4},"ヘプセラ錠１０"]
["ベプリコ－ル錠５０ｍｇ",null,null,"▲","b",null,"b",{"$nulls":5},"ベプリコ－ル錠５０ｍｇ"]
["ベラサスＬＡ錠60μｇ","科研",null,"▲","g",null,null,"g",null,null,"薬剤全体が徐放",null,"ベラサスＬＡ錠60μｇ"]
["ペラゾリン細粒　４００ｍｇ　０．５ｇ",{"$nulls":3},"b",null,"b",{"$nulls":5},"ペラゾリン細粒　４００ｍｇ　０．５ｇ"]
["ベリチーム配合顆粒　１ｇ",{"$nulls":3},"g",null,"g",{"$nulls":3},"胃・腸溶混合顆粒",null,"ベリチーム配合顆粒　１ｇ"]
["ペリンドプリル錠４ｍｇ「日医工」","日医工",null,"●","b",null,"b",{"$nulls":5},"ペリンドプリル錠４ｍｇ「日医工」"]
["ペルサンチンＬカプセル　１５０ｍｇ",null,null,"×","g",null,"g",{"$nulls":3},"徐放性顆粒　最小通過は12Fr.多めの水で懸濁しゆっくり注入",null,"ペルサンチンＬカプセル　１５０ｍｇ"]
["ペルサンチン錠２５ｍｇ　",null,null,"▲","b",null,"b",{"$nulls":5},"ペルサンチン錠２５ｍｇ　"]
["ベルソムラ錠15ｍｇ","MSD",null,"×","g",{"$nulls":3},"g",{"$nulls":3},"ベルソムラ錠15ｍｇ"]
["ベルソムラ錠20ｍｇ","MSD",null,"×","g",{"$nulls":3},"g",{"$nulls":3},"ベルソムラ錠20ｍｇ"]
["ヘルベッサ－Ｒカプセル１００ｍｇ　",null,null,"●","g",null,"g",{"$nulls":3},"スパンスル型。速効性＋徐放性。",null,"ヘルベッサ－Ｒカプセル１００ｍｇ　"]
["ペルマックス錠２５０μｇ",null,null,"×","b",null,"b",{"$nulls":5},"ペルマックス錠２５０μｇ"]
["ベンザリン錠　５ｍｇ",null,null,"●","b",null,"b",{"$nulls":5},"ベンザリン錠　５ｍｇ"]
["ペンタサ錠　５００ｍｇ",null,null,"▲","g",null,"g",{"$nulls":3},"250mg参照",null,"ペンタサ錠　５００ｍｇ"]
["ホーネル錠　０．３μｇ",null,null,"▲","b",null,"b",{"$nulls":5},"ホーネル錠　０．３μｇ"]
["ホスミシン錠５００ｍｇ",null,null,"▲","b",null,"b",{"$nulls":5},"ホスミシン錠５００ｍｇ"]
["ボルタレンＳＲカプセル　３７．５ｍｇ",null,null,"●","b",null,"b",{"$nulls":3},"注入速度を遅くすれば8Fr.可","ゆっくり注入","ボルタレンＳＲカプセル　３７．５ｍｇ"]
["ボルタレン錠　２５ｍｇ",null,null,"●","c",null,"c",{"$nulls":5},"ボルタレン錠　２５ｍｇ"]
["ポルトラック原末　６ｇ",{"$nulls":3},"b",null,"b",{"$nulls":5},"ポルトラック原末　６ｇ"]
["ボンゾ－ル錠　２００ｍｇ",null,null,"▲","b",null,"b",{"$nulls":5},"ボンゾ－ル錠　２００ｍｇ"]
["マイスタン錠５ｍｇ","大日本住友",null,"▲","b",{"$nulls":3},"b",{"$nulls":3},"マイスタン錠５ｍｇ"]
["マイテラ－ゼ　１０ｍｇ",null,null,"▲","b",null,"b",{"$nulls":3},"錠剤が少し残るがフラッシュで可",null,"マイテラ－ゼ　１０ｍｇ"]
["マグラックス錠２５０ｍｇ　",null,null,"×","b",null,"b",{"$nulls":5},"マグラックス錠２５０ｍｇ　"]
["マグラックス錠３３０ｍｇ　",null,null,"×","b",null,"b",{"$nulls":5},"マグラックス錠３３０ｍｇ　"]
["マドパー配合錠",null,null,"●","b",null,"b",{"$nulls":3},"ドパミン製剤のため酸化マグネシウムと同時懸濁しない","酸化ﾏｸﾞﾈｼｳﾑ(ﾏｸﾞﾗｯｸｽ等)と同時懸濁しない","マドパー配合錠"]
["マブリン散　１％",{"$nulls":3},"b",null,"b",{"$nulls":5},"マブリン散　１％"]
["ミオナール錠５０ｍｇ　",null,null,"●","c",null,"c",{"$nulls":5},"ミオナール錠５０ｍｇ　"]
["ミカルディス錠４０ｍｇ","ベーリンガー",null,"●","c",null,null,"c",{"$nulls":4},"ミカルディス錠４０ｍｇ"]
["ミコブティンカプセル１５０ｍｇ","ファイザー",null,"▲","b",{"$nulls":3},"b",{"$nulls":3},"ミコブティンカプセル１５０ｍｇ"]
["ミコンビ配合錠ＡＰ","ベーリンガー",null,"▲","g",{"$nulls":3},"g",{"$nulls":3},"ミコンビ配合錠ＡＰ"]
["ミニリンメルトＯＤ錠120μｇ","フェリングファーマ",null,"×","g","g",{"$nulls":6},"ミニリンメルトＯＤ錠120μｇ"]
["ミニリンメルトＯＤ錠60μｇ","フェリングファーマ",null,"×","g","g",{"$nulls":6},"ミニリンメルトＯＤ錠60μｇ"]
["ミノマイシン顆粒　２０ｍｇ",{"$nulls":3},"b",null,"b",{"$nulls":5},"ミノマイシン顆粒　２０ｍｇ"]
["ミヤＢＭ細粒　５００ｇ","ミヤリサン",null,null,"b",null,null,"b",null,null,"細粒のデータはないが、細粒を固めたものが錠なので流用。55℃の温湯で60分菌数変化なし。賦形剤の沈降炭酸カルシウムが溶け残る可能性あり→上清だけ注入してもよい。",null,"ミヤＢＭ細粒　５００ｇ"]
["ミヤＢＭ錠","ミヤリサン",null,"●","b",null,null,"b",null,null,"55℃の温湯で60分菌数変化なし。賦形剤の沈降炭酸カルシウムが溶け残る可能性あり→上清だけ注入してもよい。",null,"ミヤＢＭ錠"]
["ミラペックスＬＡ錠０．３７５ｍｇ","ベーリンガー",null,"×","g",null,null,"g",null,null,"徐放",null,"ミラペックスＬＡ錠０．３７５ｍｇ"]
["ミラペックスＬＡ錠１．５ｍｇ","ベーリンガー",null,"×","g",null,null,"g",null,null,"徐放",null,"ミラペックスＬＡ錠１．５ｍｇ"]
["ムコスタ顆粒２０％　０．５ｇ",{"$nulls":3},"b",null,"b",{"$nulls":5},"ムコスタ顆粒２０％　０．５ｇ"]
["ムコダインＤＳ　５０％　１００Ｇ","杏林",null,null,"b",null,null,"b",{"$nulls":4},"ムコダインＤＳ　５０％　１００Ｇ"]
["メイアクトＭＳ小児用細粒　１００ｍｇ",{"$nulls":3},"b",null,"b",{"$nulls":5},"メイアクトＭＳ小児用細粒　１００ｍｇ"]
["メイラックス錠１ｍｇ",null,null,"●","b",null,"b",{"$nulls":5},"メイラックス錠１ｍｇ"]
["メインテート錠０．６２５ｍｇ","田辺三菱",null,"●","c",null,null,"c",{"$nulls":4},"メインテート錠０．６２５ｍｇ"]
["メインテート錠２．５ｍｇ　",null,null,"●","c","c",null,"g",null,"c","割線ありの製剤へ変更されてからのデータでは簡易懸濁不適。他院DBでは温湯の量を増やすor放置時間を長くすることで対応。実験の結果OK。",null,"メインテート錠２．５ｍｇ　"]
["メキシチールカプセル５０ｍｇ　",null,null,"●","b",null,"b",{"$nulls":5},"メキシチールカプセル５０ｍｇ　"]
["メジコン散　１０％",{"$nulls":3},"b",null,"b",{"$nulls":5},"メジコン散　１０％"]
["メジコン錠　１５ｍｇ",null,null,"●","b",null,"b",{"$nulls":5},"メジコン錠　１５ｍｇ"]
["メスチノン錠　６０ｍｇ",null,null,"▲","b",null,"b",{"$nulls":5},"メスチノン錠　６０ｍｇ"]
["メソトレキセート錠２．５ｍｇ",null,null,"×","g",null,"g",{"$nulls":3},"抗がん剤",null,"メソトレキセート錠２．５ｍｇ"]
["メタルカプタ－ゼカプセル２００ｍｇ",null,null,"▲","b",null,"b",{"$nulls":3},"100mg参照",null,"メタルカプタ－ゼカプセル２００ｍｇ"]
["メチコバール錠５００μｇ　",null,null,"●","b",null,"b",{"$nulls":5},"メチコバール錠５００μｇ　"]
["メチルエルゴメトリン錠　０．１２５ｍｇ「あすか」　","あすか",null,"▲","b",null,"b",{"$nulls":5},"メチルエルゴメトリン錠　０．１２５ｍｇ「あすか」　"]
["メトグルコ錠　２５０ｍｇ","大日本住友",null,"●","b",{"$nulls":3},"b",{"$nulls":3},"メトグルコ錠　２５０ｍｇ"]
["メトリジン錠２ｍｇ",null,null,"●","b",null,"b",{"$nulls":5},"メトリジン錠２ｍｇ"]
["メトレート錠２ｍｇ","参天",null,"×",{"$f":"IF(F537&G537&H537&H537&I537&J537=\"\",\"\",IF(F537&G537&H537&I537=\"\",J537,IF(F537&G537&H537=\"\",I537,(IF(F537&G537=\"\",H537,IF(F537=\"\",G537,F537))))))","v":"b"},null,"b",{"$nulls":3},"メトトレキサート","単独投与　投与器具は毎回破棄　暴露に注意","メトレート錠２ｍｇ"]
["メドロール錠　４ｍｇ",null,null,"▲","b",null,"b",{"$nulls":5},"メドロール錠　４ｍｇ"]
["メネシット配合錠１００",null,null,"●","b",null,"b",{"$nulls":3},"ドパミン製剤のため酸化マグネシウムと同時懸濁しない","酸化ﾏｸﾞﾈｼｳﾑ(ﾏｸﾞﾗｯｸｽ等)と同時懸濁しない","メネシット配合錠１００"]
["メプチンドライシロップ0.005%","大塚製薬",null,null,"b","b",{"$nulls":4},"メプチン錠は懸濁可/簡易懸濁データなし","単独投与　常温の水で懸濁","メプチンドライシロップ0.005%"]
["メプチン錠５０μｇ",null,null,"▲","b",null,"b",{"$nulls":5},"メプチン錠５０μｇ"]
["メマリーＯＤ錠20ｍｇ","第一三共",null,"▲","b",null,null,"b",null,null,"55℃以上は凝集物質が生成","常温の水で懸濁","メマリーＯＤ錠20ｍｇ"]
["メリスロン錠　６ｍｇ",null,null,"●","b",null,"b",{"$nulls":5},"メリスロン錠　６ｍｇ"]
["メルカゾール錠　５ｍｇ",null,null,"●","g",null,"g",{"$nulls":5},"メルカゾール錠　５ｍｇ"]
["メンドン７．５ｍｇ",null,null,"▲","b",null,"b",{"$nulls":5},"メンドン７．５ｍｇ"]
["モサプリドクエン酸塩錠5mg「日医工」",null,null,"●","b",null,"b",{"$nulls":5},"モサプリドクエン酸塩錠5mg「日医工」"]
["モ－ビック錠１０ｍｇ","ベーリンガー",null,"▲","b",{"$nulls":3},"b",{"$nulls":3},"モ－ビック錠１０ｍｇ"]
["薬用炭",{"$nulls":3},"g","g",{"$nulls":6},"薬用炭"]
["ユーエフティカプセル１００ｍｇ","大鵬薬品",null,"×","b",null,null,"b",null,null,"抗がん剤","単独投与　投与器具は毎回破棄　暴露に注意","ユ－エフティカプセル１００ｍｇ"]
["ユーゼル錠２５ｍｇ","大鵬",null,"▲","b",null,"b",{"$nulls":3},"抗がん剤","単独投与　投与器具は毎回破棄　暴露に注意","ユーゼル錠２５ｍｇ"]
["ユーロジン１ｍｇ錠",null,null,"●","b",null,"b",{"$nulls":5},"ユーロジン１ｍｇ錠"]
["ユナシン細粒小児用　１００ｍｇ",{"$nulls":3},"g",null,"g",{"$nulls":3},"最小通過は18Fr.",null,"ユナシン細粒小児用　１００ｍｇ"]
["ユナシン錠　３７５ｍｇ",null,null,"▲","b",null,"b",{"$nulls":5},"ユナシン錠　３７５ｍｇ"]
["ユニフィルＬＡ錠２００ｍｇ",null,null,"▲","g",null,"g",{"$nulls":3},"徐放",null,"ユニフィルＬＡ錠２００ｍｇ"]
["ユベラＮカプセル　１００ｍｇ",null,null,"●","b",null,"b",{"$nulls":5},"ユベラＮカプセル　１００ｍｇ"]
["ユリーフ錠４ｍｇ",null,null,"●","b",null,"b",{"$nulls":5},"ユリーフ錠４ｍｇ"]
["ユリノーム錠５０ｍｇ　",null,null,"●","b",null,"b",{"$nulls":5},"ユリノーム錠５０ｍｇ　"]
["ヨウ化カリウム「日医工」",{"$nulls":3},"b",null,"b",{"$nulls":5},"ヨウ化カリウム「日医工」"]
["ラシックス２０ｍｇ錠",null,null,"●","b",null,"b",{"$nulls":5},"ラシックス２０ｍｇ錠"]
["ラジレス錠１５０ｍｇ","ノバルティス",null,"×","g",{"$nulls":3},"g",{"$nulls":3},"ラジレス錠１５０ｍｇ"]
["ラックビ－Ｒ（シール）１ｇ",{"$nulls":3},"b",null,"b",{"$nulls":3},"温湯による生菌数低下の可能性あり","常温の水で懸濁","ラックビ－Ｒ（シール）１ｇ"]
["ラックビー微粒Ｎ　１％　1GX1008包","興和創薬",null,null,"b","b",null,"g",null,null,"温湯による生菌数低下の可能性あり","常温の水で懸濁","ラックビー微粒Ｎ　１％　1GX1008包"]
["ラニラピッド錠　０．１ｍｇ",null,null,"●","b",null,"b",{"$nulls":5},"ラニラピッド錠　０．１ｍｇ"]
["ラフチジン錠10mg「日医工」","日医工",null,"●","b",null,"b",{"$nulls":5},"ラフチジン錠10mg「日医工」"]
["ラベキュアパック４００","エーザイ",null,"×","g","g",{"$nulls":4},"特殊",null,"ラベキュアパック４００"]
["ラベプラゾールNa塩錠10mg「明治」","Ｍｅｉｊｉ",null,"●","g",null,"g",{"$nulls":3},"腸瘻なら可　腸溶性",null,"ラベプラゾールNa塩錠10mg「明治」"]
["ラミクタール錠１００ｍｇ　","グラクソ",null,"▲","b",null,"b","b",{"$nulls":4},"ラミクタール錠１００ｍｇ　"]
["ラミクタール錠２５ｍｇ　","グラクソ",null,"▲","b",null,"b","b",{"$nulls":4},"ラミクタール錠２５ｍｇ　"]
["ラミクタール錠小児用２ｍｇ　","グラクソ",null,"▲","b",null,"b","b",{"$nulls":4},"ラミクタール錠小児用２ｍｇ　"]
["ラミクタール錠小児用５ｍｇ　","グラクソ",null,"▲","b",null,"b","b",{"$nulls":4},"ラミクタール錠小児用５ｍｇ　"]
["ランソプラゾールOD錠15mg「トーワ」",null,null,"●","b",null,"b",{"$nulls":3},"温湯でタラコ状に固まる","常温の水で懸濁","ランソプラゾールOD錠15mg「トーワ」"]
["リーゼ錠５ｍｇ",null,null,"●","b",null,"b",{"$nulls":5},"リーゼ錠５ｍｇ"]
["リーマス錠２００ｍｇ",null,null,"▲","c",null,"c",{"$nulls":5},"リーマス錠２００ｍｇ"]
["リオレサール錠５ｍｇ",null,null,"●","b",null,"b",{"$nulls":5},"リオレサール錠５ｍｇ"]
["リクシアナ錠60ｍｇ","第一三共",null,"●","b",null,null,"b",{"$nulls":4},"リクシアナ錠60ｍｇ"]
["リザベンカプセル１００ｍｇ",null,null,"▲","b",null,"b",{"$nulls":5},"リザベンカプセル１００ｍｇ"]
["リスパダ－ル錠１ｍｇ",null,null,"●","b",null,"b",{"$nulls":5},"リスパダ－ル錠１ｍｇ"]
["リスミー錠１ｍｇ",null,null,"●","b",null,"b",{"$nulls":5},"リスミー錠１ｍｇ"]
["リズミック錠１０ｍｇ",null,null,"●","b",null,"b",{"$nulls":5},"リズミック錠１０ｍｇ"]
["リ－バクト配合顆粒　４．１５ｇ",{"$nulls":3},"g",null,"g",{"$nulls":5},"リ－バクト配合顆粒　４．１５ｇ"]
["リパクレオンカプセル１５０ｍｇ","アボット",null,"●","g",null,null,"g",null,null,"胃内で失活",null,"リパクレオンカプセル１５０ｍｇ"]
["リバロ錠２ｍｇ","興和",null,"●","b",null,null,"b",null,null,"光に不安定なので懸濁後30分以内に注入",null,"リバロ錠２ｍｇ"]
["リファジンカプセル　１５０ｍｇ","第一三共",null,"●","b",null,null,"b",null,null,"カプセルの一部がシリンジ付着するが通過には問題なし",null,"リファジンカプセル　１５０ｍｇ"]
["リフレックス錠１５ｍｇ","Ｍｅｉｊｉ",null,"▲","b",null,null,"b",{"$nulls":4},"リフレックス錠１５ｍｇ"]
["リボトリール細粒　０．１％",{"$nulls":3},"b",null,"b",{"$nulls":3},"多めの水でフラッシュ","多めの水でフラッシュ","リボトリール細粒　０．１％"]
["リボトリール錠０．５ｍｇ",null,null,"●","b",null,"b",{"$nulls":5},"リボトリール錠０．５ｍｇ"]
["リマチル　１００ｍｇ",null,null,"▲","g",null,"g",{"$nulls":3},"吸湿性",null,"リマチル　１００ｍｇ"]
["リマプロストアルファデクス錠５μｇ「F」","富士製薬",null,"×","b",null,"b",{"$nulls":5},"リマプロストアルファデクス錠５μｇ「F」"]
["硫酸アトロピン","ファイザー",null,null,"b","b",{"$nulls":4},"簡易懸濁データなし","単独投与　常温の水で懸濁","硫酸アトロピン"]
["リリカカプセル２５ｍｇ　","ファイザー",null,"●","b",null,null,"b",null,null,"150mgのデータ参照",null,"リリカカプセル２５ｍｇ　"]
["リリカカプセル７５ｍｇ","ファイザー",null,"●","b",null,null,"b",null,null,"150mgのデータ参照",null,"リリカカプセル７５ｍｇ"]
["リルテック錠　５０ｍｇ",null,null,"▲","c",null,"c",{"$nulls":5},"リルテック錠　５０ｍｇ"]
["リンデロン散　０．１％",{"$nulls":3},"b",null,"b",{"$nulls":5},"リンデロン散　０．１％"]
["リンデロン錠　０．５ｍｇ",null,null,"●","b",null,"b",{"$nulls":5},"リンデロン錠　０．５ｍｇ"]
["ルーラン錠４ｍｇ",null,null,"▲","b",null,"b",{"$nulls":5},"ルーラン錠４ｍｇ"]
["ルジオミール錠１０ｍｇ",null,null,"▲","b",null,"b",{"$nulls":5},"ルジオミール錠１０ｍｇ"]
["ルセフィ錠2.5ｍｇ","大正富山",null,"▲","b",null,null,"b",{"$nulls":4},"ルセフィ錠2.5ｍｇ"]
["ルネスタ錠1ｍｇ","エーザイ",null,"●","g",null,"g",{"$nulls":3},"類縁物質増加",null,"ルネスタ錠1ｍｇ"]
["ルプラック錠４ｍｇ",null,null,"●","b",null,"b",{"$nulls":3},"8mg参照",null,"ルプラック錠４ｍｇ"]
["ルボックス錠　２５ｍｇ",null,null,"●","c",null,"c",{"$nulls":5},"ルボックス錠　２５ｍｇ"]
["ルリッド錠１５０",null,null,"▲",{"$f":"IF(F601&G601&H601&H601&I601&J601=\"\",\"\",IF(F601&G601&H601&I601=\"\",J601,IF(F601&G601&H601=\"\",I601,(IF(F601&G601=\"\",H601,IF(F601=\"\",G601,F601))))))","v":"b"},null,"b",{"$nulls":5},"ルリッド錠１５０"]
["レイアタッツカプセル１５０ｍｇ","ブリストルマイヤーズ",null,"×","b",null,"b",{"$nulls":3},"HIV",null,"レイアタッツカプセル１５０ｍｇ"]
["レキップＣＲ錠２ｍｇ","グラクソ",null,"▲","g",null,null,"g",{"$nulls":4},"レキップＣＲ錠２ｍｇ"]
["レキップ錠０．２５ｍｇ","グラクソ",null,"▲","b",null,"b","b",{"$nulls":4},"レキップ錠０．２５ｍｇ"]
["レキップ錠１ｍｇ","グラクソ",null,"▲","b",null,"b","b",{"$nulls":4},"レキップ錠１ｍｇ"]
["レキップ錠ＣＲ8ｍｇ","グラクソ",null,"▲","g",null,null,"g",{"$nulls":4},"レキップ錠ＣＲ8ｍｇ"]
["レクサプロ錠１０ｍｇ","田辺三菱","持田製薬","▲","b",null,null,"b",{"$nulls":4},"レクサプロ錠１０ｍｇ"]
["レクシヴァ錠７００","ヴィーブ",null,"×","c",null,"c",{"$nulls":3},"HIV",null,"レクシヴァ錠７００"]
["レクチゾール錠２５ｍｇ",null,null,"▲","b",null,"b",{"$nulls":5},"レクチゾール錠２５ｍｇ"]
["レグパラ錠25ｍｇ","協和発酵キリン",null,"●","b",null,null,"b",{"$nulls":4},"レグパラ錠25ｍｇ"]
["レスタミンコーワ錠　１０ｍｇ",null,null,"▲","c",null,"c",{"$nulls":5},"レスタミンコーワ錠　１０ｍｇ"]
["レダマイシンカプセル　１５０ｍｇ",null,null,"▲","b",null,"b",{"$nulls":5},"レダマイシンカプセル　１５０ｍｇ"]
["レトロビルカプセル　１００ｍｇ",null,null,"×","b",null,"b",{"$nulls":3},"HIV",null,"レトロビルカプセル　１００ｍｇ"]
["レナデックス錠　４ｍｇ","セルジーン",null,"▲","b",{"$nulls":3},"b",{"$nulls":3},"レナデックス錠　４ｍｇ"]
["レバチオ錠２０ｍｇ","ファイザー",null,"▲","b",null,null,"b",null,null,"120mlのフラッシュ必要","多めの水でフラッシュ","レバチオ錠２０ｍｇ"]
["レバミピド錠100mg「EMEC」","ＥＭＥＣ","大原","●","b",null,"b","b",{"$nulls":4},"レバミピド錠100mg「EMEC」"]
["レフト－ゼ錠（５０ｍｇ）",null,null,"▲","c",null,"c",{"$nulls":5},"レフト－ゼ錠（５０ｍｇ）"]
["レブラミドカプセル　５ｍｇ","セルジーン",null,"×","b",null,null,"b",null,null,"抗がん剤","単独投与　投与器具は毎回破棄　暴露に注意","レブラミドカプセル　５ｍｇ"]
["レベトールカプセル２００ｍｇ","MSD",null,"▲","b",{"$nulls":3},"b",null,"カプセルがゼラチンのため溶解は可だが催奇形性・原薬の刺激性あり","単独投与　投与器具は毎回破棄　暴露に注意","レベトールカプセル２００ｍｇ"]
["レボフロキサシン錠２５０ｍｇ「DSEP]","第一三共エスファ",null,"▲","c",null,null,"c",{"$nulls":4},"レボフロキサシン錠２５０ｍｇ「DSEP]"]
["レボフロキサシン錠５００ｍｇ「DSEP]","第一三共エスファ",null,"●","c",null,null,"c",{"$nulls":4},"レボフロキサシン錠５００ｍｇ「DSEP]"]
["レボレード錠　１２．５ｍｇ","グラクソ",null,"×","g",null,null,"g",null,null,"懸濁するとAUC22％上昇",null,"レボレード錠　１２．５ｍｇ"]
["レミニールＯＤ錠　４ｍｇ","武田","ヤンセン","▲","b",{"$nulls":3},"b",{"$nulls":3},"レミニールＯＤ錠　４ｍｇ"]
["ロイケリン散　１０％",{"$nulls":3},"b",null,"b",{"$nulls":3},"抗がん剤","単独投与　投与器具は毎回破棄　暴露に注意","ロイケリン散　１０％"]
["ロイコボリン錠５ｍｇ","ファイザー",null,"▲","b",null,"b",{"$nulls":3},"抗がん剤","単独投与　投与器具は毎回破棄　暴露に注意","ロイコボリン錠５ｍｇ"]
["ロイコン錠１０ｍｇ",null,null,"▲","b",null,"b",{"$nulls":5},"ロイコン錠１０ｍｇ"]
["ロカルトロ－ルカプセル０．５μｇ",null,null,"▲","b",null,"b",{"$nulls":5},"ロカルトロ－ルカプセル０．５μｇ"]
["ロキソプロフェン錠６０ｍｇ　「ＥＭＥＣ」",null,null,"●","c",null,"c",{"$nulls":5},"ロキソプロフェン錠６０ｍｇ　「ＥＭＥＣ」"]
["ロゼレム錠８ｍｇ","武田",null,"●","c",null,null,"c",{"$nulls":4},"ロゼレム錠８ｍｇ"]
["ロペミンカプセル　１ｍｇ　","ヤンセン",null,"●","b",null,"b",{"$nulls":5},"ロペミンカプセル　１ｍｇ　"]
["ロルカム錠４ｍｇ",null,null,"▲","b",null,"b",{"$nulls":5},"ロルカム錠４ｍｇ"]
["ワーファリン錠１ｍｇ",null,null,"●","b",null,"b",{"$nulls":5},"ワーファリン錠１ｍｇ"]
["ワイパックス錠　０．５ｍｇ",null,null,"●","b",null,"b",{"$nulls":5},"ワイパックス錠　０．５ｍｇ"]
["ワカデニン腸溶錠10ｍｇ","わかもと",null,"▲","g","g",{"$nulls":4},"胃酸に弱い",null,"ワカデニン腸溶錠10ｍｇ"]
["ワソラン錠４０ｍｇ",null,null,"●","c",null,"c",{"$nulls":5},"ワソラン錠４０ｍｇ"]
["ワンアルファ錠　０．２５μｇ　",null,null,"●","b",null,"b",{"$nulls":5},"ワンアルファ錠　０．２５μｇ　"]
["ワンアルファ錠　１μｇ　",null,null,"●","b",null,"b",{"$nulls":5},"ワンアルファ錠　１μｇ　"]
["塩酸プロカルバジンカプセル　５０ｍｇ","中外",null,"×","b",null,"b",{"$nulls":3},"抗がん剤","単独投与　投与器具は毎回破棄　暴露に注意","塩酸プロカルバジンカプセル　５０ｍｇ"]
["塩酸ミノサイクリンカプセル１００「日医工」","日医工",null,"●","b",null,"b",{"$nulls":3},"色が濃いのでフラッシュ必要","多めの水でフラッシュ","塩酸ミノサイクリンカプセル１００「日医工」"]
["臭化カリウム　１００ｇ","山善",null,null,"b",null,null,"b",{"$nulls":4},"臭化カリウム　１００ｇ"]
["炭酸水素ナトリウム　５００ｇ「シオエ」","日本新薬","シオエ",null,"b",{"$nulls":3},"b",null,"アルカリ性になる　「シオエ」のデータはないが可と考える",null,"炭酸水素ナトリウム　５００ｇ「シオエ」"]
["調剤用パンビタン末","武田",null,null,"b",{"$nulls":3},"b",{"$nulls":3},"調剤用パンビタン末"]
["乳酸カルシウム「ヨシダ」　",{"$nulls":3},"b",null,"b",{"$nulls":5},"乳酸カルシウム「ヨシダ」　"]
["乳糖　（粒状）　５００ｇ","健栄",null,null,"b",null,null,"b",{"$nulls":4},"乳糖　（粒状）　５００ｇ"]
["硫酸ポリミキシンＢ錠100万単位","ファイザ-",null,"▲","g",null,"g",{"$nulls":3},"吸湿性",null,"硫酸ポリミキシンＢ錠100万単位"]

{"sheet":"20150612メーカーまで入力済み保存版","index":4,"n_rows":633,"n_cols":13,"rows_kept":633,"hidden":true}
["2015.2月末の当院採用薬品\na.無し b.懸濁可 c.破壊 d.粉砕　e.条件付 f.懸濁不可 g.懸濁不適",{"$nulls":5},"a.無し b.懸濁可 c.破壊 d.粉砕　e.条件付 f.懸濁不可 g.懸濁不適"]
["薬品名","販売","製造","一包化最終決定","簡易懸濁最終決定","特殊等","ハンドブック","メーカー","他院DB","実験","条件","コメント","薬品名"]
["Ｄ－ソルビトール","丸石",{"$nulls":5},"データなし",null,null,"水に溶けやすい",null,"Ｄ－ソルビトール"]
["Ｌ－ケフレックス顆粒　５００ｍｇ",{"$nulls":5},"g",{"$nulls":5},"Ｌ－ケフレックス顆粒　５００ｍｇ"]
["ＰＬ配合顆粒",{"$nulls":5},"b",{"$nulls":5},"ＰＬ配合顆粒"]
["Ｓ・Ｍ散",{"$nulls":5},"b",{"$nulls":5},"Ｓ・Ｍ散"]
["アーチスト錠１０ｍｇ",null,null,"●",null,null,"b",{"$nulls":5},"アーチスト錠１０ｍｇ"]
["アーチスト錠２．５ｍｇ","第一三共",null,"●",{"$nulls":3},"b",{"$nulls":4},"アーチスト錠２．５ｍｇ"]
["アーテン錠（２ｍｇ）　",null,null,"▲",null,null,"b",{"$nulls":5},"アーテン錠（２ｍｇ）　"]
["アイセントレス錠４００ｍｇ","MSD",null,"×",null,null,"g",{"$nulls":3},"HIV/破壊し長時間かければ投与可",null,"アイセントレス錠４００ｍｇ"]
["アイトロール錠２０ｍｇ",null,null,"▲",null,null,"b",{"$nulls":5},"アイトロール錠２０ｍｇ"]
["アカルディカプセル１．２５ｍｇ",null,null,"×",null,null,"b",{"$nulls":5},"アカルディカプセル１．２５ｍｇ"]
["アキネトン錠　１ｍｇ",null,null,"▲",null,null,"b",{"$nulls":5},"アキネトン錠　１ｍｇ"]
["アクトス錠１５",null,null,"▲",null,null,"b",{"$nulls":5},"アクトス錠１５"]
["アクトネル錠２．５ｍｇ","エーザイ","味のもと","▲",{"$nulls":3},"b",null,null,"17.5mgのデータ参照",null,"アクトネル錠２．５ｍｇ"]
["アコファイド錠100ｍｇ","ゼリア",null,"▲",{"$nulls":3},"b",{"$nulls":4},"アコファイド錠100ｍｇ"]
["アサコール錠４００ｍｇ","協和発酵キリン","ゼリア","×",{"$nulls":3},"g",null,null,"小腸で吸収",null,"アサコール錠４００ｍｇ"]
["アザルフィジンＥＮ錠　５００ｍｇ",null,null,"▲",null,null,"c",{"$nulls":5},"アザルフィジンＥＮ錠　５００ｍｇ"]
["アシノン錠１５０ｍｇ",null,null,"▲",null,null,"b",{"$nulls":5},"アシノン錠１５０ｍｇ"]
["アジャストＡコーワ錠４０ｍｇ",null,null,"●",null,null,"b",{"$nulls":5},"アジャストＡコーワ錠４０ｍｇ"]
["アジルバ錠４０ｍｇ","武田",null,"●",{"$nulls":3},"b",{"$nulls":4},"アジルバ錠４０ｍｇ"]
["アスパラカリウム散　５０％","田辺製薬販売",{"$nulls":3},"g",null,"データなし",{"$nulls":4},"アスパラカリウム散　５０％"]
["アスパラカリウム錠　３００ｍｇ",null,null,"×",null,null,"g",{"$nulls":5},"アスパラカリウム錠　３００ｍｇ"]
["アスピリン","日本新薬","シオエ",{"$nulls":4},"データなし",{"$nulls":4},"アスピリン"]
["アスペノンカプセル１０ｍｇ",null,null,"▲",null,null,"b",{"$nulls":5},"アスペノンカプセル１０ｍｇ"]
["アセチルスピラマイシン錠　２００ｍｇ",null,null,"▲",null,null,"b",{"$nulls":5},"アセチルスピラマイシン錠　２００ｍｇ"]
["アセトアミノフェン「マルイシ」",{"$nulls":5},"e",{"$nulls":5},"アセトアミノフェン「マルイシ」"]
["アタラックス－Ｐカプセル２５ｍｇ　",null,null,"●",null,null,"b",{"$nulls":5},"アタラックス－Ｐカプセル２５ｍｇ　"]
["アデホスコーワ顆粒１０％",{"$nulls":5},"g",{"$nulls":5},"アデホスコーワ顆粒１０％"]
["アテレック錠　１０ｍｇ",null,null,"●",null,null,"b",{"$nulls":5},"アテレック錠　１０ｍｇ"]
["アドシルカ錠20ｍｇ","リリー","日本新薬","▲",{"$nulls":3},"データなし",{"$nulls":4},"アドシルカ錠20ｍｇ"]
["アドソルビン",{"$nulls":5},"b",{"$nulls":5},"アドソルビン"]
["アドナ錠３０ｍｇ　",null,null,"×",null,null,"b",{"$nulls":5},"アドナ錠３０ｍｇ　"]
["アトルバスタチンOD錠10mg「トーワ」","東和",null,"▲",null,null,"c",{"$nulls":5},"アトルバスタチンOD錠10mg「トーワ」"]
["アナフラニール錠１０ｍｇ",null,null,"×",null,null,"c",{"$nulls":5},"アナフラニール錠１０ｍｇ"]
["アフィニトール錠　５ｍｇ","ノバルティス",null,"▲",null,null,"b",{"$nulls":3},"抗がん剤",null,"アフィニトール錠　５ｍｇ"]
["アプレゾリン錠１０ｍｇ　",null,null,"▲",null,null,"c",{"$nulls":5},"アプレゾリン錠１０ｍｇ　"]
["アベロックス錠４００ｍｇ","富士フィルム","バイエル","▲",null,null,"b",{"$nulls":5},"アベロックス錠４００ｍｇ"]
["アボルブカプセル　０．５ｍｇ","グラクソ",null,"▲",{"$nulls":3},"g",null,null,"カプセル内脂溶性液体・口腔内刺激あり",null,"アボルブカプセル　０．５ｍｇ"]
["アマリ－ル１ｍｇ錠",null,null,"×",null,null,"b",{"$nulls":5},"アマリ－ル１ｍｇ錠"]
["アミサリン錠１２５ｍｇ",null,null,"▲",null,null,"g",{"$nulls":5},"アミサリン錠１２５ｍｇ"]
["アミティーザカプセル24μｇ","スキャンポファーマ",null,"▲",{"$nulls":3},"b",{"$nulls":4},"アミティーザカプセル24μｇ"]
["アムノレイク錠２ｍｇ","日本新薬","東光","●",{"$nulls":3},"データなし",null,null,"抗がん剤",null,"アムノレイク錠２ｍｇ"]
["アムロジピンＯＤ錠5ｍｇ「ＥＭＥＣ」",null,null,"●",null,null,"b",{"$nulls":5},"アムロジピンＯＤ錠5ｍｇ「ＥＭＥＣ」"]
["アメパロモカプセル250ｍｇ","ファイザー",null,"×",{"$nulls":3},"データなし",{"$nulls":4},"アメパロモカプセル250ｍｇ"]
["アモキサンカプセル２５ｍｇ",null,null,"▲",null,null,"b",{"$nulls":5},"アモキサンカプセル２５ｍｇ"]
["アモキシシリンカプセル250mg「日医工」","日医工",null,"▲",null,null,"b",{"$nulls":3},"内容物粒子が大きめで大量のため十分なフラッシュを",null,"アモキシシリンカプセル250mg「日医工」"]
["アリセプトＤ錠３ｍｇ",null,null,"▲",null,null,"b",{"$nulls":4},"放置時間5分ぐらい長めで懸濁可","アリセプトＤ錠３ｍｇ"]
["アリセプトＤ錠５ｍｇ",null,null,"●",null,null,"b",{"$nulls":5},"アリセプトＤ錠５ｍｇ"]
["アリナミンＦ糖衣錠２５ｍｇ　",null,null,"▲",null,null,"c",{"$nulls":5},"アリナミンＦ糖衣錠２５ｍｇ　"]
["アリミデックス錠　１ｍｇ","アストラゼネカ",null,"●",null,null,"b",{"$nulls":3},"抗がん剤",null,"アリミデックス錠　１ｍｇ"]
["アルケラン錠　２ｍｇ",null,null,"●",null,null,"b",{"$nulls":3},"抗がん剤",null,"アルケラン錠　２ｍｇ"]
["アルサルミン細粒　９０％",{"$nulls":5},"b",{"$nulls":5},"アルサルミン細粒　９０％"]
["アルダクトンＡ錠　２５ｍｇ　",null,null,"▲",null,null,"b",{"$nulls":5},"アルダクトンＡ錠　２５ｍｇ　"]
["アルドメット錠　２５０ｍｇ",null,null,"×",null,null,"b",{"$nulls":5},"アルドメット錠　２５０ｍｇ"]
["アルファロール散　１μｇ／ｇ","中外",{"$nulls":5},"b",{"$nulls":4},"アルファロール散　１μｇ／ｇ"]
["アレセンサカプセル20ｍｇ","中外",null,"▲",{"$nulls":3},"b",null,null,"抗がん剤",null,"アレセンサカプセル20ｍｇ"]
["アレセンサカプセル40ｍｇ","中外",null,"▲",{"$nulls":3},"b",null,null,"抗がん剤",null,"アレセンサカプセル40ｍｇ"]
["アレビアチン散１０％","大日本住友",{"$nulls":5},"データなし",{"$nulls":4},"アレビアチン散１０％"]
["アレロック顆粒０．５％","協和発酵キリン",{"$nulls":5},"g",{"$nulls":4},"アレロック顆粒０．５％"]
["アロチノロール塩酸塩錠１０ｍｇ「ＤＳＰ」","大日本住友",null,"×",null,null,"b",{"$nulls":5},"アロチノロール塩酸塩錠１０ｍｇ「ＤＳＰ」"]
["アロプリノール錠100ｍｇ「杏林」","杏林",null,"▲",null,null,"b",{"$nulls":5},"アロプリノール錠100ｍｇ「杏林」"]
["アロマシン錠25ｍｇ","ファイザー",null,"▲",null,null,"b",{"$nulls":3},"抗がん剤",null,"アロマシン錠25ｍｇ"]
["アンカロン錠100ｍｇ",null,null,"▲",null,null,"b",{"$nulls":5},"アンカロン錠100ｍｇ"]
["アンコチル錠500ｍｇ",null,null,"▲",null,null,"b",{"$nulls":5},"アンコチル錠500ｍｇ"]
["アンナカ「ヨシダ」",{"$nulls":5},"b",{"$nulls":5},"アンナカ「ヨシダ」"]
["アンブロキソール塩酸塩錠15mg「サワイ」","沢井",null,"●",null,null,"b",{"$nulls":5},"アンブロキソール塩酸塩錠15mg「サワイ」"]
["アンブロキソール塩酸塩徐放OD錠45mg「サワイ」","沢井",null,"●",{"$nulls":3},"b",{"$nulls":4},"アンブロキソール塩酸塩徐放OD錠45mg「サワイ」"]
["イーケプラ錠250ｍｇ","ＵＣＢ","大塚","●",null,null,"c",{"$nulls":5},"イーケプラ錠250ｍｇ"]
["イーケプラ錠500ｍｇ","ＵＣＢ","大塚","▲",null,null,"c",{"$nulls":5},"イーケプラ錠500ｍｇ"]
["イグザレルト錠10ｍｇ","バイエル",null,"●",null,null,"b",{"$nulls":5},"イグザレルト錠10ｍｇ"]
["イグザレルト錠15ｍｇ","バイエル",null,"▲",null,null,"b",{"$nulls":5},"イグザレルト錠15ｍｇ"]
["イクスタンジカプセル40ｍｇ","アステラス",null,"×",{"$nulls":3},"g",null,null,"抗がん剤/難水性の溶剤を充填",null,"イクスタンジカプセル40ｍｇ"]
["イコサペント酸エチル粒状カプセル９００ｍｇ　「サワイ」",{"$nulls":5},"b",{"$nulls":5},"イコサペント酸エチル粒状カプセル９００ｍｇ　「サワイ」"]
["イスコチン錠100ｍｇ",null,null,"●",null,null,"b",{"$nulls":5},"イスコチン錠100ｍｇ"]
["イスコチン末１００％　１００ｇ","第一三共",{"$nulls":5},"データなし",{"$nulls":4},"イスコチン末１００％　１００ｇ"]
["イトラコナゾール錠100「ＭＥＥＫ」","Ｍｅｉｊｉ","小林化工","▲",{"$nulls":3},"c ",{"$nulls":4},"イトラコナゾール錠100「ＭＥＥＫ」"]
["イノベロン錠200ｍｇ","エーザイ",null,"▲",{"$nulls":3},"b",null,null,"沈殿性浮遊物あるが8Fr.通過",null,"イノベロン錠200ｍｇ"]
["イミグラン錠５０","グラクソ",null,"▲",null,null,"b","b",{"$nulls":4},"イミグラン錠５０"]
["イムセラカプセル0.5mg","田辺三菱",null,"×",{"$nulls":3},"データなし",{"$nulls":4},"イムセラカプセル0.5mg"]
["イムラン錠50ｍｇ",null,null,"▲",null,null,"b",{"$nulls":5},"イムラン錠50ｍｇ"]
["イメンドカプセル 80ｍｇ","小野",null,"×",null,"g",null,"データなし",null,null,"プロイメンドあり",null,"イメンドカプセル 80ｍｇ"]
["イメンドカプセル125ｍｇ","小野",null,"×",null,"g",null,"データなし",null,null,"プロイメンドあり",null,"イメンドカプセル125ｍｇ"]
["イリボーＯＤ錠５μｇ","アステラス",null,"▲",{"$nulls":3},"b",null,null,"ガラス容器だと吸着",null,"イリボーＯＤ錠５μｇ"]
["イレッサ錠２５０","アストラゼネカ",null,"×",null,null,"b",{"$nulls":3},"抗がん剤",null,"イレッサ錠２５０"]
["インタール細粒１０％","サノフィ",{"$nulls":5},"データなし",{"$nulls":4},"インタール細粒１０％"]
["インデラル錠１０ｍｇ",null,null,"▲",null,null,"b",{"$nulls":5},"インデラル錠１０ｍｇ"]
["インフリーＳカプセル２００ｍｇ",null,null,"▲",null,null,"b",{"$nulls":5},"インフリーＳカプセル２００ｍｇ"]
["インライタ錠１ｍｇ","ファイザー",null,"×",{"$nulls":3},"データなし",null,null,"抗がん剤",null,"インライタ錠１ｍｇ"]
["インライタ錠５ｍｇ","ファイザー",null,"×",{"$nulls":3},"データなし",null,null,"抗がん剤",null,"インライタ錠５ｍｇ"]
["ヴアイデックスＥＣカプセル１２５　","ブリストルマイヤーズ",null,"×",null,null,"g",{"$nulls":3},"HIV",null,"ヴアイデックスＥＣカプセル１２５　"]
["ヴォトリエント錠200ｍｇ","グラクソ",null,"×",{"$nulls":3},"g",null,null,"抗がん剤/粉砕するとCmax/AUC増加する",null,"ヴォトリエント錠200ｍｇ"]
["ウテメリン　５ｍｇ　",null,null,"▲",null,null,"b",{"$nulls":5},"ウテメリン　５ｍｇ　"]
["ウブレチド錠　５ｍｇ",null,null,"▲",null,null,"b",{"$nulls":5},"ウブレチド錠　５ｍｇ"]
["ウラリット配合錠",null,null,"●",null,null,"c",{"$nulls":5},"ウラリット配合錠"]
["ウリトスＯＤ錠　０．１ｍｇ","杏林",null,"▲",{"$nulls":3},"b",{"$nulls":4},"ウリトスＯＤ錠　０．１ｍｇ"]
["ウルソ錠１００ｍｇ",null,null,"●",null,null,"b",{"$nulls":5},"ウルソ錠１００ｍｇ"]
["ウロカルン錠２２５ｍｇ",null,null,"▲",null,null,"b",{"$nulls":5},"ウロカルン錠２２５ｍｇ"]
["エクア錠　５０ｍｇ","ノバルティス",null,"●",{"$nulls":3},"データなし",{"$nulls":4},"エクア錠　５０ｍｇ"]
["エクジェイド懸濁用５００ｍｇ","ノバルティス",null,"×",{"$nulls":3},"データなし",{"$nulls":4},"エクジェイド懸濁用５００ｍｇ"]
["エクセグラン散　２０％",{"$nulls":5},"b",{"$nulls":5},"エクセグラン散　２０％"]
["エクセグラン錠１００ｍｇ",null,null,"▲",null,null,"b",{"$nulls":5},"エクセグラン錠１００ｍｇ"]
["エジュラント錠25ｍｇ","ヤンセン",null,"×",{"$nulls":3},"データなし",null,null,"HIV",null,"エジュラント錠25ｍｇ"]
["エスカゾール錠200ｍｇ","グラクソ",null,"▲",{"$nulls":3},"b",{"$nulls":4},"エスカゾール錠200ｍｇ"]
["エストラサイトカプセル　１５６．７ｍｇ","日新",null,"×",null,null,"b",{"$nulls":3},"冷所",null,"エストラサイトカプセル　１５６．７ｍｇ"]
["エチゾラム錠0.5ｍｇ「ＥＭＥＣ」",null,null,"●",null,null,"b",{"$nulls":5},"エチゾラム錠0.5ｍｇ「ＥＭＥＣ」"]
["エディロールカプセル０．７５μｇ","中外",null,"▲",{"$nulls":3},"g",{"$nulls":4},"エディロールカプセル０．７５μｇ"]
["エナラプリルＭ錠５「ＥＭＥＣ」","エルドメットエーザイ",null,"●",{"$nulls":3},"b",{"$nulls":4},"エナラプリルＭ錠５「ＥＭＥＣ」"]
["エバステル錠１０ｍｇ",null,null,"▲",null,null,"b",{"$nulls":5},"エバステル錠１０ｍｇ"]
["エピビル錠　１５０ｍｇ","グラクソ","ヴィープ","×",null,null,"b","b",null,null,"HIV",null,"エピビル錠　１５０ｍｇ"]
["エビプロスタット配合錠ＤＢ",null,null,"▲",null,null,"g",{"$nulls":5},"エビプロスタット配合錠ＤＢ"]
["エフィエント錠3.75ｍｇ","第一三共",null,"●",{"$nulls":3},"e",null,null,"30℃10分（30分おくのは不可）55℃10分放置は類縁物質増加",null,"エフィエント錠3.75ｍｇ"]
["エフィエント錠5ｍｇ","第一三共",null,"▲",{"$nulls":3},"e",null,null,"30℃10分（30分おくのは不可）55℃10分放置は類縁物質増加",null,"エフィエント錠5ｍｇ"]
["エプジコム錠","ヴィーブ",null,"×",null,null,"c",{"$nulls":3},"HIV",null,"エプジコム錠"]
["エブトール２５０ｍｇ錠　",null,null,"●",null,null,"g",{"$nulls":5},"エブトール２５０ｍｇ錠　"]
["エフピ－ＯＤ錠２．５ｍｇ","エフピー",null,"×",{"$nulls":3},"b",null,null,"覚せい剤原料",null,"エフピ－ＯＤ錠２．５ｍｇ"]
["エブランチルカプセル１５ｍｇ　",null,null,"▲",null,null,"e",{"$nulls":5},"エブランチルカプセル１５ｍｇ　"]
["エリキュース錠（2.5ｍｇ）","ブリストルマイヤーズ",null,"●",null,null,"b",{"$nulls":5},"エリキュース錠（2.5ｍｇ）"]
["エリキュース錠（5ｍｇ）","ブリストルマイヤーズ",null,"●",null,null,"b",{"$nulls":5},"エリキュース錠（5ｍｇ）"]
["エリスロシン錠（２００ｍｇ）",null,null,"▲",null,null,"c",{"$nulls":5},"エリスロシン錠（２００ｍｇ）"]
["エルカルチンFF錠１００ｍｇ","大塚",null,"×",{"$nulls":3},"c",{"$nulls":4},"エルカルチンFF錠１００ｍｇ"]
["エンドキサン錠　５０ｍｇ",null,null,"×",null,null,"g",{"$nulls":3},"抗がん剤",null,"エンドキサン錠　５０ｍｇ"]
["オイグルコン錠１．２５ｍｇ","中外",null,"▲",null,null,"b",{"$nulls":5},"オイグルコン錠１．２５ｍｇ"]
["オーグメンチン配合錠２５０ＲＳ　（３７５ｍｇ）","グラクソ",null,"×",null,null,"g","g",null,null,"吸湿性強い",null,"オーグメンチン配合錠２５０ＲＳ　（３７５ｍｇ）"]
["オ－クル錠　１００ｍｇ",null,null,"▲",null,null,"c",{"$nulls":5},"オ－クル錠　１００ｍｇ"]
["オゼックス細粒小児用１５％","大正富山",{"$nulls":5},"b",null,null,"データないが水に溶解するためOKと思われる",null,"オゼックス細粒小児用１５％"]
["オダイン錠　１２５ｍｇ",null,null,"×",null,null,"b",{"$nulls":3},"抗がん剤",null,"オダイン錠　１２５ｍｇ"]
["オラセフ錠　２５０ｍｇ",null,null,"×",null,null,"b",{"$nulls":5},"オラセフ錠　２５０ｍｇ"]
["オルメテック錠２０ｍｇ","第一三共",null,"●",{"$nulls":3},"b",{"$nulls":4},"オルメテック錠２０ｍｇ"]
["オロパタジン塩酸塩ＯＤ錠5mg「明治」","Ｍｅｉｊｉ",null,"●",null,null,"b",{"$nulls":5},"オロパタジン塩酸塩ＯＤ錠5mg「明治」"]
["カイトリル錠２ｍｇ",null,null,"×",null,null,"b",{"$nulls":5},"カイトリル錠２ｍｇ"]
["ガスター散１０％　１００ｇ","アステラス",{"$nulls":5},"データなし",{"$nulls":4},"ガスター散１０％　１００ｇ"]
["ガステール　４０ｍｇ","扶桑",null,"▲",null,null,"b",{"$nulls":5},"ガステール　４０ｍｇ"]
["ガストローム顆粒　６６．７％",{"$nulls":5},"g",{"$nulls":5},"ガストローム顆粒　６６．７％"]
["ガスロンＮ錠４ｍｇ　",null,null,"●",null,null,"b",{"$nulls":5},"ガスロンＮ錠４ｍｇ　"]
["カソデックスＯＤ錠８０ｍｇ",null,null,"×",null,null,"g",{"$nulls":3},"抗がん剤",null,"カソデックスＯＤ錠８０ｍｇ"]
["カタプレス錠７５　０．０７５ｍｇ",null,null,"×",null,null,"b",{"$nulls":5},"カタプレス錠７５　０．０７５ｍｇ"]
["カチーフＮ錠５ｍｇ",null,null,"▲",null,null,"b",{"$nulls":5},"カチーフＮ錠５ｍｇ"]
["ガナトン錠５０ｍｇ",null,null,"●",null,null,"c",{"$nulls":5},"ガナトン錠５０ｍｇ"]
["カナマイシンカプセル明治　２５０ｍｇ",null,null,"▲",null,null,"b",{"$nulls":5},"カナマイシンカプセル明治　２５０ｍｇ"]
["カバサ－ル錠　１ｍｇ",null,null,"▲",null,null,"b",{"$nulls":5},"カバサ－ル錠　１ｍｇ"]
["ガバペン錠２００ｍｇ","ファイザー",null,"▲",{"$nulls":3},"c",null,null,"120mlのフラッシュで残留無し",null,"ガバペン錠２００ｍｇ"]
["ガバペン錠３００ｍｇ","ファイザー",null,"▲",{"$nulls":3},"c",null,null,"180ｍｌのフラッシュで残留無し",null,"ガバペン錠３００ｍｇ"]
["カプトリル錠１２．５ｍｇ","第一三共エスファ",null,"▲",{"$nulls":3},"データなし",{"$nulls":4},"カプトリル錠１２．５ｍｇ"]
["ガランターゼ散　５０％　０．５ｇ","田辺製薬販売",{"$nulls":3},"g",null,"データなし",null,null,"酵素製剤であり55℃では失活",null,"ガランターゼ散　５０％　０．５ｇ"]
["カルグート錠　５ｍｇ",null,null,"▲",null,null,"b",{"$nulls":5},"カルグート錠　５ｍｇ"]
["カルタンＯＤ錠５００ｍｇ","マイラン",null,"●",null,null,"b",{"$nulls":5},"カルタンＯＤ錠５００ｍｇ"]
["カルデナリン錠１ｍｇ",null,null,"●",null,null,"b",{"$nulls":5},"カルデナリン錠１ｍｇ"]
["カルナクリン錠５０　５０国際単位",null,null,"▲",null,null,"g",{"$nulls":5},"カルナクリン錠５０　５０国際単位"]
["カルブロック錠１６ｍｇ",null,null,"●",null,null,"c",{"$nulls":5},"カルブロック錠１６ｍｇ"]
["カルボシステイン錠250ｍｇ「テバ」","テバ",null,"●",null,null,"b",{"$nulls":5},"カルボシステイン錠250ｍｇ「テバ」"]
["カレトラ配合錠","アッヴィ合同",null,"×",null,null,"g",{"$nulls":3},"HIV",null,"カレトラ配合錠"]
["カロナール錠　２００ｍｇ",null,null,"●",null,null,"b",{"$nulls":5},"カロナール錠　２００ｍｇ"]
["カンデサルタン錠８ｍｇ「あすか」","あすか",null,"●",{"$nulls":3},"b",{"$nulls":4},"カンデサルタン錠８ｍｇ「あすか」"]
["キネダック錠　５０ｍｇ",null,null,"▲",null,null,"b",{"$nulls":5},"キネダック錠　５０ｍｇ"]
["きゅう帰調血飲エキス顆粒","太虎精堂",{"$nulls":5},"b",{"$nulls":4},"きゅう帰調血飲エキス顆粒"]
["クエチアピン錠25ｍｇ「ＤＳＥＰ」",null,null,"●",null,null,"b",{"$nulls":5},"クエチアピン錠25ｍｇ「ＤＳＥＰ」"]
["グッドミン錠０．２５ｍｇ",null,null,"●",null,null,"b",{"$nulls":5},"グッドミン錠０．２５ｍｇ"]
["グラケ－カプセル１５ｍｇ　",null,null,"▲",null,null,"b",{"$nulls":5},"グラケ－カプセル１５ｍｇ　"]
["クラシエ十全大補湯エキス細粒",{"$nulls":5},"b",{"$nulls":5},"クラシエ十全大補湯エキス細粒"]
["クラシエ当帰芍薬散料エキス細粒　２ｇ","クラシエ",{"$nulls":5},"b",{"$nulls":4},"クラシエ当帰芍薬散料エキス細粒　２ｇ"]
["クラシエ半夏厚朴湯","クラシエ",{"$nulls":5},"b",{"$nulls":4},"クラシエ半夏厚朴湯"]
["クラシエ芍薬甘草湯エキス細粒",{"$nulls":5},"b",{"$nulls":5},"クラシエ芍薬甘草湯エキス細粒"]
["グラマリール錠２５ｍｇ　",null,null,"▲",null,null,"c",{"$nulls":5},"グラマリール錠２５ｍｇ　"]
["クラリシッド錠２００ｍｇ","アボット",null,"▲",{"$nulls":3},"b",null,null,"クラリス同等",null,"クラリシッド錠２００ｍｇ"]
["グランダキシン錠５０ｍｇ　",null,null,"▲",null,null,"g",{"$nulls":5},"グランダキシン錠５０ｍｇ　"]
["グリチロン配合錠",null,null,"●",null,null,"c",{"$nulls":5},"グリチロン配合錠"]
["グリベック錠１００ｍｇ",null,null,"×",null,null,"b",{"$nulls":3},"抗がん剤",null,"グリベック錠１００ｍｇ"]
["グリミクロン錠　４０ｍｇ",null,null,"▲",null,null,"b",{"$nulls":5},"グリミクロン錠　４０ｍｇ"]
["グルコバイ錠５０ｍｇ",null,null,"×",null,null,"b",{"$nulls":5},"グルコバイ錠５０ｍｇ"]
["グルコンサンＫ細粒　４ｍEq/g",{"$nulls":5},"b",{"$nulls":5},"グルコンサンＫ細粒　４ｍEq/g"]
["グルファスト錠　１０ｍｇ","キッセイ",null,"▲",null,null,"b",{"$nulls":5},"グルファスト錠　１０ｍｇ"]
["クレストール錠２．５ｍｇ","アストラゼネカ",null,"●",{"$nulls":3},"データなし",{"$nulls":4},"クレストール錠２．５ｍｇ"]
["クレメジンカプセル２００ｍｇ",null,null,"×",null,null,"e",null,null,"○",null,null,"クレメジンカプセル２００ｍｇ"]
["クレメジン細粒分包２ｇ",{"$nulls":5},"e",{"$nulls":5},"クレメジン細粒分包２ｇ"]
["ケイキサレート散　５ｇ",{"$nulls":5},"e",{"$nulls":5},"ケイキサレート散　５ｇ"]
["ケーサプライ錠600mg","アルフレッサ","佐藤薬品","●",null,"g",{"$nulls":4},"徐放",null,"ケーサプライ錠600mg"]
["ケタスカプセル１０ｍｇ",null,null,"▲",null,null,"b",{"$nulls":5},"ケタスカプセル１０ｍｇ"]
["ケフラールカプセル２５０ｍｇ",null,null,"▲",null,null,"b",{"$nulls":5},"ケフラールカプセル２５０ｍｇ"]
["ケフラール細粒小児用１００ｍｇ",{"$nulls":5},"b",{"$nulls":5},"ケフラール細粒小児用１００ｍｇ"]
["コデインリン酸塩「タケダ」　１％","武田",{"$nulls":5},"データなし",{"$nulls":4},"コデインリン酸塩「タケダ」　１％"]
["コ－トリル錠　１０ｍｇ",null,null,"▲",null,null,"b",{"$nulls":5},"コ－トリル錠　１０ｍｇ"]
["コニール錠４",null,null,"●",null,null,"b",{"$nulls":5},"コニール錠４"]
["コペガス錠２００ｍｇ","中外",null,"▲",{"$nulls":3},"g",null,null,"55℃20mL30分放置で懸濁可",null,"コペガス錠２００ｍｇ"]
["コムタン錠１００ｍｇ","ノバルティス",null,"▲",null,null,"b",{"$nulls":5},"コムタン錠１００ｍｇ"]
["コランチル配合顆粒　１ｇ",{"$nulls":5},"b",{"$nulls":5},"コランチル配合顆粒　１ｇ"]
["コルヒチン錠「タカタ」　０．５ｍｇ","高田製薬",null,"▲",null,null,"b",{"$nulls":5},"コルヒチン錠「タカタ」　０．５ｍｇ"]
["コレアジン錠12.5ｍｇ","アルフレッサ",null,"▲",{"$nulls":3},"b",{"$nulls":4},"コレアジン錠12.5ｍｇ"]
["コレバインミニ８３％　１．８１ｇ",{"$nulls":5},"g",{"$nulls":5},"コレバインミニ８３％　１．８１ｇ"]
["コロネル錠　５００ｍｇ",null,null,"▲",null,null,"g",{"$nulls":5},"コロネル錠　５００ｍｇ"]
["コントール散１％","武田",{"$nulls":5},"データなし",{"$nulls":4},"コントール散１％"]
["コントミン糖衣錠　１２．５ｍｇ",null,null,"▲",null,null,"c",{"$nulls":5},"コントミン糖衣錠　１２．５ｍｇ"]
["サアミオン錠　５ｍｇ",null,null,"▲",null,null,"c",{"$nulls":5},"サアミオン錠　５ｍｇ"]
["ザイアジェン錠３００ｍｇ","ヴィーブ",null,"×",null,null,"b",{"$nulls":3},"HIV",null,"ザイアジェン錠３００ｍｇ"]
["ザイザル錠５ｍｇ","グラクソ",null,"●",null,null,"b","b",{"$nulls":4},"ザイザル錠５ｍｇ"]
["ザイティガ錠250ｍｇ","ヤンセン",null,"×",{"$nulls":3},"データなし",null,null,"抗がん剤",null,"ザイティガ錠250ｍｇ"]
["サイトテック錠２００",null,null,"▲",null,null,"b",{"$nulls":5},"サイトテック錠２００"]
["ザイボックス錠６００ｍｇ","ファイザー",null,"×",null,null,"b",{"$nulls":5},"ザイボックス錠６００ｍｇ"]
["サイレース錠１ｍｇ　",null,null,"▲",null,null,"b",{"$nulls":5},"サイレース錠１ｍｇ　"]
["サインバルタカプセル２０ｍｇ","リリー","塩野義","▲",null,null,"g",{"$nulls":5},"サインバルタカプセル２０ｍｇ"]
["ザジテンＤＳ　０．１％","ノバルティスファーマ",{"$nulls":5},"データなし",{"$nulls":4},"ザジテンＤＳ　０．１％"]
["サムスカ錠１５ｍｇ","大塚",null,"▲",{"$nulls":3},"b",null,null,"口渇を感じない患者は禁忌",null,"サムスカ錠１５ｍｇ"]
["サムスカ錠7.5ｍｇ","大塚",null,"▲",{"$nulls":3},"b",null,null,"口渇を感じない患者は禁忌",null,"サムスカ錠7.5ｍｇ"]
["サラゾピリン錠　５００ｍｇ",null,null,"▲",null,null,"b",{"$nulls":5},"サラゾピリン錠　５００ｍｇ"]
["ザルティア錠5ｍｇ","リリー",null,"▲",{"$nulls":3},"b",{"$nulls":4},"ザルティア錠5ｍｇ"]
["サレドカプセル１００ｍｇ","藤本製薬",null,"×",null,null,"b",{"$nulls":3},"抗がん剤",null,"サレドカプセル１００ｍｇ"]
["サレドカプセル５０ｍｇ","藤本製薬",null,"×",null,null,"b",{"$nulls":3},"抗がん剤",null,"サレドカプセル５０ｍｇ"]
["サワシリン細粒　１００ｍｇ",{"$nulls":5},"b",{"$nulls":5},"サワシリン細粒　１００ｍｇ"]
["酸化マグネシウム「シオエ」","日本新薬","シオエ",{"$nulls":4},"データなし",{"$nulls":4},"酸化マグネシウム「シオエ」"]
["ザンタック錠　１５０",null,null,"×",null,null,"c",{"$nulls":5},"ザンタック錠　１５０"]
["サンリズムカプセル２５ｍｇ",null,null,"●",null,null,"b",{"$nulls":5},"サンリズムカプセル２５ｍｇ"]
["ジアゾキシドカプセル25ｍｇ「ＭＳＤ」","MSD",null,"▲",{"$nulls":3},"データなし",{"$nulls":4},"ジアゾキシドカプセル25ｍｇ「ＭＳＤ」"]
["シーエルセントリ錠125ｍｇ","ヴィーブ",null,"×",null,null,"b",{"$nulls":3},"HIV",null,"シーエルセントリ錠125ｍｇ"]
["ジェイゾロフト錠２５ｍｇ","ファイザー",null,"▲",{"$nulls":3},"g",null,null,"シリンジ内付着",null,"ジェイゾロフト錠２５ｍｇ"]
["ジェニナック錠２００ｍｇ","大正富山",null,"▲",{"$nulls":3},"b",{"$nulls":4},"ジェニナック錠２００ｍｇ"]
["ジオトリフ錠20ｍｇ","ベーリンガー",null,"×",{"$nulls":3},"データなし",null,null,"抗がん剤/懸濁液の安定性（55℃10ｍｌ10分）はあるがチューブ通過は確認なし",null,"ジオトリフ錠20ｍｇ"]
["ジオトリフ錠30ｍｇ","ベーリンガー",null,"×",{"$nulls":3},"データなし",null,null,"抗がん剤/懸濁液の安定性（55℃10ｍｌ10分）はあるがチューブ通過は確認なし",null,"ジオトリフ錠30ｍｇ"]
["ジオトリフ錠40ｍｇ","ベーリンガー",null,"×",{"$nulls":3},"データなし",null,null,"抗がん剤/懸濁液の安定性（55℃10ｍｌ10分）はあるがチューブ通過は確認なし",null,"ジオトリフ錠40ｍｇ"]
["ジオトリフ錠50ｍｇ","ベーリンガー",null,"×",{"$nulls":3},"データなし",null,null,"抗がん剤/懸濁液の安定性（55℃10ｍｌ10分）はあるがチューブ通過は確認なし",null,"ジオトリフ錠50ｍｇ"]
["ジゴシン１０００倍散　０．１％","中外",{"$nulls":5},"データなし",{"$nulls":4},"ジゴシン１０００倍散　０．１％"]
["ジスロマックカプセル小児用１００ｍｇ",null,null,"▲",null,null,"b",{"$nulls":5},"ジスロマックカプセル小児用１００ｍｇ"]
["ジスロマック細粒　小児用",{"$nulls":5},"b",{"$nulls":5},"ジスロマック細粒　小児用"]
["ジスロマック錠２５０ｍｇ　",null,null,"×",null,null,"b",{"$nulls":3},"特殊",null,"ジスロマック錠２５０ｍｇ　"]
["シナール配合顆粒　１ｇ",{"$nulls":5},"b",{"$nulls":5},"シナール配合顆粒　１ｇ"]
["ジプレキサ錠２．５ｍｇ","リリー",null,"▲",{"$nulls":3},"データなし",{"$nulls":4},"ジプレキサ錠２．５ｍｇ"]
["シプロキサン錠１００ｍｇ",null,null,"▲",null,null,"b",{"$nulls":5},"シプロキサン錠１００ｍｇ"]
["シベノール錠５０ｍｇ　",null,null,"▲",null,null,"b",{"$nulls":5},"シベノール錠５０ｍｇ　"]
["ジャカビ錠5ｍｇ","ノバルティス",null,"×",{"$nulls":3},"データなし",null,null,"抗がん剤",null,"ジャカビ錠5ｍｇ"]
["ジャヌビア錠　５０ｍｇ",null,null,"●",null,null,"b",{"$nulls":5},"ジャヌビア錠　５０ｍｇ"]
["ジルテック錠１０","UCジャパン",null,"●",null,null,"b",{"$nulls":5},"ジルテック錠１０"]
["シングレアチュアブル錠５","MSD",null,"×",{"$nulls":3},"g",null,null,"キプレスと同等、不適",null,"シングレアチュアブル錠５"]
["シングレア細粒４ｍｇ","MSD",{"$nulls":5},"データなし",{"$nulls":4},"シングレア細粒４ｍｇ"]
["シングレア錠１０　１０ｍｇ","MSD",null,"▲",{"$nulls":3},"g",null,null,"キプレスと同等、不適",null,"シングレア錠１０　１０ｍｇ"]
["シンセロン錠８ｍｇ","杏林",null,"×",{"$nulls":3},"データなし",{"$nulls":4},"シンセロン錠８ｍｇ"]
["シンメトレル細粒１０％",{"$nulls":5},"b",{"$nulls":5},"シンメトレル細粒１０％"]
["シンメトレル錠５０ｍｇ",null,null,"▲",null,null,"b",{"$nulls":5},"シンメトレル錠５０ｍｇ"]
["スーテントカプセル１２．５ｍｇ","ファイザー",null,"×",null,null,"b",{"$nulls":3},"抗がん剤",null,"スーテントカプセル１２．５ｍｇ"]
["スタラシドカプセル５０ｍｇ","日本化薬",null,"×",null,null,"b",{"$nulls":3},"抗がん剤",null,"スタラシドカプセル５０ｍｇ"]
["スタリビルド配合錠","日本たばこ産業",null,"×",{"$nulls":3},"e",null,null,"HIV/常温で",null,"スタリビルド配合錠"]
["スチバーガ錠40ｍｇ","バイエル",null,"×",{"$nulls":3},"データなし",null,null,"抗がん剤",null,"スチバーガ錠40ｍｇ"]
["ストックリン錠２００ｍｇ","MSD",null,"×",{"$nulls":3},"データなし",null,null,"HIV",null,"ストックリン錠２００ｍｇ"]
["ストックリン錠６００ｍｇ","MSD",null,"×",null,null,"g","データなし",null,null,"HIV",null,"ストックリン錠６００ｍｇ"]
["ストロメクトール錠　３ｍｇ","マルホ","MSD","▲",null,null,"b",{"$nulls":5},"ストロメクトール錠　３ｍｇ"]
["ズファジラン錠10ｍｇ","第一三共",null,"▲",null,null,"b",{"$nulls":5},"ズファジラン錠10ｍｇ"]
["スプリセル錠２０ｍｇ","ブリストルマイヤーズ",null,"×",null,null,"b",{"$nulls":3},"抗がん剤",null,"スプリセル錠２０ｍｇ"]
["スンベプラカプセル100ｍｇ","ブリストルマイヤーズ",null,"×",{"$nulls":3},"データなし",null,null,"油の液体軟カプセルのため不可",null,"スンベプラカプセル100ｍｇ"]
["セイブル錠　５０ｍｇ","三和化学",null,"▲",{"$nulls":3},"c",{"$nulls":4},"セイブル錠　５０ｍｇ"]
["ゼチーア錠１０ｍｇ","MSD",null,"●",{"$nulls":3},"データなし",null,null,"原薬は脂溶性",null,"ゼチーア錠１０ｍｇ"]
["セディ－ル錠１０ｍｇ",null,null,"▲",null,null,"b",{"$nulls":5},"セディ－ル錠１０ｍｇ"]
["セパゾン錠２",null,null,"▲",null,null,"b",{"$nulls":5},"セパゾン錠２"]
["セファドール錠　２５ｍｇ　",null,null,"●",null,null,"b",{"$nulls":5},"セファドール錠　２５ｍｇ　"]
["セフカペンピボキシル塩酸塩錠100mg「ファイザー」","マイラン",null,"×",{"$nulls":3},"b",null,null,"残留粒子あるが押し込める",null,"セフカペンピボキシル塩酸塩錠100mg「ファイザー」"]
["セフジニル錠100mg「サワイ」","沢井",null,"●",null,null,"b",{"$nulls":5},"セフジニル錠100mg「サワイ」"]
["セフゾン細粒小児用１０％　２００ｇ",{"$nulls":5},"b",{"$nulls":5},"セフゾン細粒小児用１０％　２００ｇ"]
["セララ錠２５ｍｇ","ファイザー",null,"●",null,null,"b",{"$nulls":5},"セララ錠２５ｍｇ"]
["ゼリットカプセル　１５ｍｇ","ブリストルマイヤーズ",null,"×",null,null,"b",{"$nulls":3},"HIV",null,"ゼリットカプセル　１５ｍｇ"]
["ゼリットカプセル２０ｍｇ","ブリストルマイヤーズ",null,"×",null,null,"b",{"$nulls":3},"HIV",null,"ゼリットカプセル２０ｍｇ"]
["セルシン錠　２ｍｇ",null,null,"●",null,null,"b",{"$nulls":5},"セルシン錠　２ｍｇ"]
["セルセプトカプセル250ｍｇ","中外",null,"▲",{"$nulls":3},"b",{"$nulls":4},"セルセプトカプセル250ｍｇ"]
["セレキノン錠　１００ｍｇ",null,null,"▲",null,null,"g",{"$nulls":5},"セレキノン錠　１００ｍｇ"]
["セレクト－ル錠２００ｍｇ",null,null,"▲",null,null,"c",{"$nulls":5},"セレクト－ル錠２００ｍｇ"]
["セレコックス錠１００ｍｇ","アステラス",null,"●",{"$nulls":3},"c",{"$nulls":4},"セレコックス錠１００ｍｇ"]
["セレジスト錠５ｍｇ",null,null,"▲",null,null,"b",{"$nulls":5},"セレジスト錠５ｍｇ"]
["セレスタミン配合錠",null,null,"▲",null,null,"b",{"$nulls":5},"セレスタミン配合錠"]
["セレニカＲ顆粒　４０％",{"$nulls":5},"g",{"$nulls":5},"セレニカＲ顆粒　４０％"]
["セレネース錠　０．７５ｍｇ",null,null,"●",null,null,"b",{"$nulls":5},"セレネース錠　０．７５ｍｇ"]
["ゼローダ錠３００　","中外",null,"×",null,null,"b",{"$nulls":3},"抗がん剤",null,"ゼローダ錠３００　"]
["セロクラール錠　１０ｍｇ","日医工",null,"▲",{"$nulls":3},"g",null,null,"20mg錠のデータ参照",null,"セロクラール錠　１０ｍｇ"]
["セロケン錠２０ｍｇ",null,null,"▲",null,null,"b",{"$nulls":5},"セロケン錠２０ｍｇ"]
["セロトーン錠１０ｍｇ",null,null,"×",null,null,"b",{"$nulls":5},"セロトーン錠１０ｍｇ"]
["センノサイド錠（大正薬品）　１２ｍｇ",null,null,"●",null,null,"c",{"$nulls":5},"センノサイド錠（大正薬品）　１２ｍｇ"]
["ソセゴン錠２５ｍｇ","丸石",null,"×",null,"g",{"$nulls":4},"向精神薬2種 ソセゴン注あり",null,"ソセゴン錠２５ｍｇ"]
["ソタコール錠４０ｍｇ","ブリストルマイヤーズ",null,"▲",{"$nulls":3},"b",{"$nulls":4},"ソタコール錠４０ｍｇ"]
["ゾビラックス錠　２００ｍｇ",null,null,"▲",null,null,"b",{"$nulls":5},"ゾビラックス錠　２００ｍｇ"]
["ソブリアードカプセル100ｍｇ","ヤンセン",null,"×",{"$nulls":3},"データなし",{"$nulls":4},"ソブリアードカプセル100ｍｇ"]
["ソラナックス０．４ｍｇ錠",null,null,"●",null,null,"b",{"$nulls":5},"ソラナックス０．４ｍｇ錠"]
["ソランタール錠１００ｍｇ",null,null,"▲",null,null,"c",{"$nulls":5},"ソランタール錠１００ｍｇ"]
["ゾルピデム酒石酸塩OD錠5mg「サワイ」","沢井",null,"●",null,null,"b",{"$nulls":5},"ゾルピデム酒石酸塩OD錠5mg「サワイ」"]
["ダイアート錠６０ｍｇ",null,null,"●",null,null,"b",{"$nulls":5},"ダイアート錠６０ｍｇ"]
["ダイアモックス錠２５０ｍｇ",null,null,"▲",null,null,"b",{"$nulls":5},"ダイアモックス錠２５０ｍｇ"]
["タイケルブ錠　２５０ｍｇ","グラクソ",null,"×",null,null,"b","b",null,null,"抗がん剤",null,"タイケルブ錠　２５０ｍｇ"]
["タウリン散９８％「大正」",{"$nulls":5},"e",{"$nulls":5},"タウリン散９８％「大正」"]
["ダグルインザ錠60ｍｇ","ブリストルマイヤーズ",null,"×",{"$nulls":3},"データなし",{"$nulls":4},"ダグルインザ錠60ｍｇ"]
["タシグナカプセル１５０ｍｇ","ノバルティス",null,"×",null,null,"b",{"$nulls":3},"抗がん剤",null,"タシグナカプセル１５０ｍｇ"]
["タシグナカプセル２００ｍｇ","ノバルティス",null,"×",null,null,"b",{"$nulls":3},"抗がん剤",null,"タシグナカプセル２００ｍｇ"]
["タナド－パ顆粒　１ｇ",{"$nulls":5},"g",{"$nulls":5},"タナド－パ顆粒　１ｇ"]
["タナトリル錠５",null,null,"●",null,null,"c",{"$nulls":5},"タナトリル錠５"]
["タミフルカプセル７５ｍｇ",null,null,"×",null,null,"b",{"$nulls":5},"タミフルカプセル７５ｍｇ"]
["タミフルドライシロップ３％","中外",{"$nulls":5},"データなし",{"$nulls":4},"タミフルドライシロップ３％"]
["ダラシンカプセル　１５０ｍｇ",null,null,"●",null,null,"b",{"$nulls":5},"ダラシンカプセル　１５０ｍｇ"]
["タリオン錠１０　１０ｍｇ","田辺三菱",null,"●",{"$nulls":3},"g",{"$nulls":4},"タリオン錠１０　１０ｍｇ"]
["タルセバ錠１００ｍｇ","中外",null,"×",null,null,"b",{"$nulls":3},"抗がん剤",null,"タルセバ錠１００ｍｇ"]
["タルセバ錠１５０ｍｇ","中外",null,"×",null,null,"b",{"$nulls":3},"抗がん剤",null,"タルセバ錠１５０ｍｇ"]
["タルセバ錠２５ｍｇ","中外",null,"×",null,null,"b",{"$nulls":3},"抗がん剤",null,"タルセバ錠２５ｍｇ"]
["ダントリウムカプセル２５",null,null,"▲",null,null,"b",{"$nulls":5},"ダントリウムカプセル２５"]
["タンニン酸アルブミン","日本新薬","シオエ",{"$nulls":4},"e",null,null,"55℃では凝固するため常温の水で懸濁",null,"タンニン酸アルブミン"]
["タンボコ－ル錠　５０ｍｇ",null,null,"▲",null,null,"b",{"$nulls":5},"タンボコ－ル錠　５０ｍｇ"]
["チザニジン錠1mg「サワイ」","沢井",null,"▲",null,null,"b",{"$nulls":5},"チザニジン錠1mg「サワイ」"]
["チャンピックス錠０．５ｍｇ","ファイザー",null,"×",{"$nulls":3},"b",null,null,"フラッシュ120ｍｌ必要（ガストロは詰まるかも）",null,"チャンピックス錠０．５ｍｇ"]
["チャンピックス錠１ｍｇ","ファイザー",null,"×",{"$nulls":3},"b",null,null,"フラッシュ120ｍｌ必要（ガストロは詰まるかも）",null,"チャンピックス錠１ｍｇ"]
["チラ－ヂンＳ錠５０",null,null,"●",null,null,"c",{"$nulls":5},"チラ－ヂンＳ錠５０"]
["チロナミン錠　５μｇ",null,null,"●",null,null,"b",{"$nulls":5},"チロナミン錠　５μｇ"]
["ツムラ葛根湯エキス顆粒（医療用）",{"$nulls":5},"b",{"$nulls":5},"ツムラ葛根湯エキス顆粒（医療用）"]
["ツムラ五苓散エキス顆粒（医療用）",{"$nulls":5},"b",{"$nulls":5},"ツムラ五苓散エキス顆粒（医療用）"]
["ツムラ清心蓮子飲エキス顆粒",{"$nulls":5},"b",{"$nulls":5},"ツムラ清心蓮子飲エキス顆粒"]
["ツムラ大建中湯エキス顆粒",{"$nulls":5},"b",{"$nulls":5},"ツムラ大建中湯エキス顆粒"]
["ツムラ猪苓湯エキス顆粒",{"$nulls":5},"b",{"$nulls":5},"ツムラ猪苓湯エキス顆粒"]
["ツムラ麦門冬湯エキス顆粒",{"$nulls":5},"b",{"$nulls":5},"ツムラ麦門冬湯エキス顆粒"]
["ツムラ八味地黄丸エキス顆粒（医療用）",{"$nulls":5},"b",{"$nulls":5},"ツムラ八味地黄丸エキス顆粒（医療用）"]
["ツムラ半夏瀉心湯エキス",{"$nulls":5},"b",{"$nulls":5},"ツムラ半夏瀉心湯エキス"]
["ツムラ補中益気湯エキス顆粒",{"$nulls":5},"b",{"$nulls":5},"ツムラ補中益気湯エキス顆粒"]
["ツムラ抑肝散エキス顆粒（２．５ｇ/包）",{"$nulls":5},"b",{"$nulls":5},"ツムラ抑肝散エキス顆粒（２．５ｇ/包）"]
["ツムラ六君子湯エキス顆粒　１８９包",{"$nulls":5},"b",{"$nulls":5},"ツムラ六君子湯エキス顆粒　１８９包"]
["ティーエスワン配合OD錠T20",null,null,"×",null,null,"b",{"$nulls":3},"抗がん剤",null,"ティーエスワン配合OD錠T20"]
["ティーエスワン配合OD錠T25",null,null,"×",null,null,"b",{"$nulls":3},"抗がん剤",null,"ティーエスワン配合OD錠T25"]
["ティ－エスワン配合顆粒T２０",{"$nulls":5},"b",{"$nulls":5},"ティ－エスワン配合顆粒T２０"]
["ティ－エスワン配合顆粒T２５","大鵬",{"$nulls":5},"b",{"$nulls":4},"ティ－エスワン配合顆粒T２５"]
["テオロング錠１００ｍｇ",null,null,"●",null,null,"b",{"$nulls":5},"テオロング錠１００ｍｇ"]
["テオロング錠２００ｍｇ",null,null,"▲",null,null,"b",{"$nulls":5},"テオロング錠２００ｍｇ"]
["デカドロン錠　０．５ｍｇ",null,null,"●",null,null,"b",{"$nulls":5},"デカドロン錠　０．５ｍｇ"]
["テグレトール細粒　５０％",{"$nulls":5},"b",{"$nulls":5},"テグレトール細粒　５０％"]
["テグレトール錠　２００ｍｇ",null,null,"●",null,null,"b",{"$nulls":5},"テグレトール錠　２００ｍｇ"]
["テシプール錠　１ｍｇ",null,null,"▲",null,null,"b",{"$nulls":5},"テシプール錠　１ｍｇ"]
["デジレル錠２５",null,null,"▲",null,null,"c",{"$nulls":5},"デジレル錠２５"]
["テネリア錠20ｍｇ","田辺",null,"▲",{"$nulls":3},"c",{"$nulls":4},"テネリア錠20ｍｇ"]
["テノーミン　５０ｍｇ",null,null,"▲",null,null,"b",{"$nulls":5},"テノーミン　５０ｍｇ"]
["テノゼット錠300ｍｇ","グラクソ",null,"▲",{"$nulls":3},"b",{"$nulls":4},"テノゼット錠300ｍｇ"]
["デノタスチュアブル配合錠","第一三共",null,"×",{"$nulls":6},"55℃20mL20回以上破壊して10分で懸濁可",null,"デノタスチュアブル配合錠"]
["デパケンＲ錠１００",null,null,"▲",null,null,"g",{"$nulls":5},"デパケンＲ錠１００"]
["デパケンＲ錠２００",null,null,"●",null,null,"g",{"$nulls":5},"デパケンＲ錠２００"]
["テビケイ錠50ｍｇ","ヴィーブ",null,"×",{"$nulls":3},"データなし",null,null,"HIV",null,"テビケイ錠50ｍｇ"]
["テプレノンカプセル50ｍｇ「トーワ」","東和",null,"●",null,null,"b",{"$nulls":5},"テプレノンカプセル50ｍｇ「トーワ」"]
["テモカプリル塩酸塩錠２ｍｇ「タカタ」","高田",null,"●",null,null,"b",{"$nulls":5},"テモカプリル塩酸塩錠２ｍｇ「タカタ」"]
["テモダールカプセル１００ｍｇ","MSD",null,"×",null,null,"b",{"$nulls":3},"抗がん剤",null,"テモダールカプセル１００ｍｇ"]
["テモダールカプセル２０ｍｇ","MSD",null,"×",null,null,"b",{"$nulls":3},"抗がん剤",null,"テモダールカプセル２０ｍｇ"]
["ドグマチール錠５０ｍｇ",null,null,"●",null,null,"b",{"$nulls":5},"ドグマチール錠５０ｍｇ"]
["ドパストン散９８．５％",{"$nulls":5},"b",{"$nulls":5},"ドパストン散９８．５％"]
["トビエース錠4ｍｇ","ファイザー",null,"×",{"$nulls":3},"g",null,null,"徐放",null,"トビエース錠4ｍｇ"]
["トピナ細粒１０％","協和発酵キリン",{"$nulls":5},"b",{"$nulls":4},"トピナ細粒１０％"]
["トピナ錠５０ｍｇ","協和発酵キリン",null,"▲",{"$nulls":3},"b",{"$nulls":4},"トピナ錠５０ｍｇ"]
["ドプスOD錠２００ｍｇ","大日本住友",null,"●",{"$nulls":3},"e",null,null,"ドパミン製剤のため単独で投与",null,"ドプスOD錠２００ｍｇ"]
["ドプス細粒　２０％","大日本住友",{"$nulls":5},"データなし",{"$nulls":4},"ドプス細粒　２０％"]
["トフラニール錠１０ｍｇ",null,null,"▲",null,null,"g",{"$nulls":5},"トフラニール錠１０ｍｇ"]
["ドミン錠",null,null,"▲",null,null,"b",{"$nulls":5},"ドミン錠"]
["トラクリア錠６２．５ｍｇ","アクテリオンファーマ",null,"▲",{"$nulls":3},"b",{"$nulls":4},"トラクリア錠６２．５ｍｇ"]
["トラゼンタ錠5ｍｇ","ベーリンガー",null,"▲",{"$nulls":3},"データなし",{"$nulls":4},"トラゼンタ錠5ｍｇ"]
["トラベルミン配合錠",null,null,"●",null,null,"c",{"$nulls":5},"トラベルミン配合錠"]
["トラマールOD錠２５ｍｇ","ファイザー",null,"●",{"$nulls":3},"b",{"$nulls":4},"トラマールOD錠２５ｍｇ"]
["トラムセット配合錠","持田製薬","ヤンセン","●",{"$nulls":3},"データなし",{"$nulls":4},"トラムセット配合錠"]
["ドラ－ル錠１５　１５ｍｇ",null,null,"▲",null,null,"b",{"$nulls":5},"ドラ－ル錠１５　１５ｍｇ"]
["トランサミンカプセル　２５０ｍｇ",null,null,"●",null,null,"b",{"$nulls":5},"トランサミンカプセル　２５０ｍｇ"]
["トリアゾラム錠０．１２５ｍｇ「テバ」","テバ",null,"●",null,null,"b",{"$nulls":5},"トリアゾラム錠０．１２５ｍｇ「テバ」"]
["トリプタノ－ル錠　１０ｍｇ",null,null,"●",null,null,"b",{"$nulls":5},"トリプタノ－ル錠　１０ｍｇ"]
["トレドミン錠２５　２５ｍｇ",null,null,"▲",null,null,"b",{"$nulls":5},"トレドミン錠２５　２５ｍｇ"]
["トロペロン錠1ｍｇ",null,null,"▲",null,null,"b",{"$nulls":5},"トロペロン錠1ｍｇ"]
["ドンペリドン錠１０ｍｇ　「ＥＭＥＣ」",null,null,"●",null,null,"b",{"$nulls":5},"ドンペリドン錠１０ｍｇ　「ＥＭＥＣ」"]
["ナイキサン錠　１００ｍｇ",null,null,"●",null,null,"b",{"$nulls":5},"ナイキサン錠　１００ｍｇ"]
["ニコチン酸アミド散ゾンネ　１０％",{"$nulls":5},"b",{"$nulls":5},"ニコチン酸アミド散ゾンネ　１０％"]
["ニコランジル錠5mg「日医工」","日医工",null,"●",null,null,"b",{"$nulls":5},"ニコランジル錠5mg「日医工」"]
["ニッパスカルシウム顆粒１００％","田辺三菱",{"$nulls":5},"データなし",{"$nulls":4},"ニッパスカルシウム顆粒１００％"]
["ニトロール錠　５ｍｇ",null,null,"▲",null,null,"b",{"$nulls":5},"ニトロール錠　５ｍｇ"]
["ニトロペン舌下錠　０．３ｍｇ","日本化薬",null,"×",null,"g",{"$nulls":4},"特殊",null,"ニトロペン舌下錠　０．３ｍｇ"]
["ニバジール錠２ｍｇ",null,null,"▲",null,null,"b",{"$nulls":5},"ニバジール錠２ｍｇ"]
["ニフェジピンCR錠２０ｍｇ「日医工」","日医工",null,"●",null,"g",null,"データなし",null,null,"徐放",null,"ニフェジピンCR錠２０ｍｇ「日医工」"]
["ニポラジン錠　３ｍｇ　",null,null,"▲",null,null,"b",{"$nulls":5},"ニポラジン錠　３ｍｇ　"]
["ニュ－ロタン錠　５０ｍｇ",null,null,"●",null,null,"c",{"$nulls":5},"ニュ－ロタン錠　５０ｍｇ"]
["ネオマレルミンＴＲ錠6ｍｇ","テバ",null,"●",null,null,"g",{"$nulls":5},"ネオマレルミンＴＲ錠6ｍｇ"]
["ネオ－ラル２５ｍｇ",null,null,"×",null,null,"b",{"$nulls":3},"特殊",null,"ネオ－ラル２５ｍｇ"]
["ネキシウムカプセル２０ｍｇ",null,null,"●",null,null,"b",{"$nulls":5},"ネキシウムカプセル２０ｍｇ"]
["ネクサバール錠２００ｍｇ","バイエル",null,"×",null,null,"g",{"$nulls":3},"抗がん剤",null,"ネクサバール錠２００ｍｇ"]
["ネシーナ錠　１２．５ｍｇ","武田",null,"●",{"$nulls":3},"c",{"$nulls":4},"ネシーナ錠　１２．５ｍｇ"]
["ノイエルカプセル　２００ｍｇ",null,null,"●",null,null,"b",{"$nulls":5},"ノイエルカプセル　２００ｍｇ"]
["ノイキノン錠１０ｍｇ　",null,null,"●",null,null,"b",{"$nulls":5},"ノイキノン錠１０ｍｇ　"]
["ノイロトロピン錠　４単位　",null,null,"▲",null,null,"g",{"$nulls":5},"ノイロトロピン錠　４単位　"]
["ノウリアスト錠20ｍｇ","協和発酵キリン",null,"▲",{"$nulls":3},"b",null,null,"光に不安定",null,"ノウリアスト錠20ｍｇ"]
["ノバミン錠５ｍｇ",null,null,"●",null,null,"b",{"$nulls":5},"ノバミン錠５ｍｇ"]
["ノ－ビア錠１００ｍｇ","アッヴィ",null,"×",{"$nulls":3},"g",null,null,"HIV　カレトラ粉砕によりリトナビルのAUCが39%低下したため不適",null,"ノ－ビア錠１００ｍｇ"]
["ノルバデックス錠２０ｍｇ",null,null,"×",null,null,"b",{"$nulls":3},"抗がん剤",null,"ノルバデックス錠２０ｍｇ"]
["パーロデル２．５ｍｇ",null,null,"▲",null,null,"g",{"$nulls":5},"パーロデル２．５ｍｇ"]
["バイアスピリン",null,null,"●",null,null,"g",{"$nulls":5},"バイアスピリン"]
["バイカロン錠　２５ｍｇ",null,null,"▲",null,null,"b",{"$nulls":5},"バイカロン錠　２５ｍｇ"]
["バイシリンＧ顆粒４０万単位",{"$nulls":5},"b",{"$nulls":5},"バイシリンＧ顆粒４０万単位"]
["ハイドレアカプセル",null,null,"×",null,null,"b",{"$nulls":3},"抗がん剤",null,"ハイドレアカプセル"]
["ハイペン錠200ｍｇ　",null,null,"●",null,null,"b",{"$nulls":5},"ハイペン錠200ｍｇ　"]
["パキシルCR錠12.5ｍｇ","グラクソ",null,"▲",{"$nulls":3},"g",{"$nulls":4},"パキシルCR錠12.5ｍｇ"]
["バクタ配合錠",null,null,"●",null,null,"b",{"$nulls":5},"バクタ配合錠"]
["バップフォ－錠10ｍｇ",null,null,"▲",null,null,"b",{"$nulls":5},"バップフォ－錠10ｍｇ"]
["パナルジン錠100ｍｇ",null,null,"▲",null,null,"c",{"$nulls":5},"パナルジン錠100ｍｇ"]
["バファリン配合錠Ａ330",null,null,"×",null,null,"b",{"$nulls":5},"バファリン配合錠Ａ330"]
["バラクルード錠０．５ｍｇ","ブリストルマイヤーズ",null,"×",{"$nulls":3},"b",{"$nulls":4},"バラクルード錠０．５ｍｇ"]
["バルサルタン錠80ｍｇ「サンド」","サンド",null,"●",{"$nulls":3},"b",{"$nulls":4},"バルサルタン錠80ｍｇ「サンド」"]
["バルトレックス錠500ｍｇ","グラクソ",null,"▲",null,null,"c",{"$nulls":5},"バルトレックス錠500ｍｇ"]
["バルトレックス顆粒５０％","グラクソ",{"$nulls":5},"g",{"$nulls":4},"バルトレックス顆粒５０％"]
["ハルナールＤ錠0.2ｍｇ",null,null,"●",null,null,"b",{"$nulls":5},"ハルナールＤ錠0.2ｍｇ"]
["バレイショデンプン","日本新薬","シオエ",{"$nulls":4},"データなし",{"$nulls":4},"バレイショデンプン"]
["パントシン錠100",null,null,"▲",null,null,"g",{"$nulls":5},"パントシン錠100"]
["ビ・シフロール錠0.125ｍｇ","ブリストルマイヤーズ",null,"▲",{"$nulls":3},"データなし",{"$nulls":4},"ビ・シフロール錠0.125ｍｇ"]
["ビ・シフロール錠0.5ｍｇ","ブリストルマイヤーズ",null,"▲",{"$nulls":3},"データなし",{"$nulls":4},"ビ・シフロール錠0.5ｍｇ"]
["ビソルボン細粒　２％",{"$nulls":5},"b",{"$nulls":5},"ビソルボン細粒　２％"]
["ビソルボン錠　４ｍｇ",null,null,"●",null,null,"b",{"$nulls":5},"ビソルボン錠　４ｍｇ"]
["ビタメジン配合カプセルＢ２５",null,null,"●",null,null,"b",{"$nulls":5},"ビタメジン配合カプセルＢ２５"]
["ヒダントール錠２５ｍｇ",null,null,"▲",null,null,"b",{"$nulls":5},"ヒダントール錠２５ｍｇ"]
["ピドキサール錠　１０ｍｇ","中外",null,"●",null,null,"g",{"$nulls":5},"ピドキサール錠　１０ｍｇ"]
["ビビアント錠２０ｍｇ　","ファイザー",null,"▲",{"$nulls":3},"データなし",{"$nulls":4},"ビビアント錠２０ｍｇ　"]
["ビブラマイシン錠　１００ｍｇ",null,null,"▲",null,null,"c",{"$nulls":5},"ビブラマイシン錠　１００ｍｇ"]
["ピラマイド",{"$nulls":5},"b",{"$nulls":5},"ピラマイド"]
["ビリアード錠３００ｍｇ","日本たばこ",null,"×",null,null,"b",{"$nulls":3},"HIV",null,"ビリアード錠３００ｍｇ"]
["ビルトリシド錠600ｍｇ","バイエル",null,"×",null,null,"b",{"$nulls":5},"ビルトリシド錠600ｍｇ"]
["ヒルナミン細粒１０％",{"$nulls":5},"b",{"$nulls":4},"ゆっくり注入してください。","ヒルナミン細粒１０％"]
["ピレスパ錠２００ｍｇ","塩野義",null,"▲",null,null,"b",{"$nulls":5},"ピレスパ錠２００ｍｇ"]
["ファスティック錠９０ｍｇ",null,null,"×",null,null,"b",{"$nulls":5},"ファスティック錠９０ｍｇ"]
["ファモチジンＤ錠20ｍｇ「サワイ」",null,null,"●",null,null,"b",{"$nulls":5},"ファモチジンＤ錠20ｍｇ「サワイ」"]
["ファロム錠200ｍｇ",null,null,"▲",null,null,"g",{"$nulls":5},"ファロム錠200ｍｇ"]
["ブイフェンド錠５０ｍｇ","ファイザー",null,"×",null,null,"b",{"$nulls":5},"ブイフェンド錠５０ｍｇ"]
["フェアストン錠　４０ｍｇ",null,null,"×",null,null,"b",{"$nulls":3},"抗がん剤",null,"フェアストン錠　４０ｍｇ"]
["フェキソフェナジン塩酸塩錠６０ｍｇ「SANIK」","日医工サノフィー",null,"●",{"$nulls":3},"g",{"$nulls":4},"フェキソフェナジン塩酸塩錠６０ｍｇ「SANIK」"]
["フェネルミン錠50mg",null,null,"●",null,null,"b",{"$nulls":5},"フェネルミン錠50mg"]
["フェノバール散　１０％","第一三共","藤永",{"$nulls":4},"b",{"$nulls":4},"フェノバール散　１０％"]
["フェノバール錠３０ｍｇ","藤永",null,"▲",null,null,"b",{"$nulls":5},"フェノバール錠３０ｍｇ"]
["フェブリク錠２０ｍｇ","帝人ファーマ",null,"●",null,null,"b",{"$nulls":5},"フェブリク錠２０ｍｇ"]
["フェマーラ錠　２．５ｍｇ","ノバルティス",null,"×",null,null,"b",{"$nulls":3},"抗がん剤",null,"フェマーラ錠　２．５ｍｇ"]
["フェロ・グラデュメット錠１０５ｍｇ　",null,null,"●",null,null,"g",{"$nulls":5},"フェロ・グラデュメット錠１０５ｍｇ　"]
["フェロベリン錠","MSD",null,"▲",null,null,"b","データなし",{"$nulls":4},"フェロベリン錠"]
["フオイパン錠　１００ｍｇ",null,null,"●",null,null,"b",{"$nulls":5},"フオイパン錠　１００ｍｇ"]
["フォサマック錠３５ｍｇ","MSD",null,"×",{"$nulls":3},"b",null,null,"特殊",null,"フォサマック錠３５ｍｇ"]
["フォスブロック錠２５０ｍｇ","協和発酵キリン",null,"●",{"$nulls":3},"g",null,null,"吸湿性で膨脹",null,"フォスブロック錠２５０ｍｇ"]
["フォリアミン錠　５ｍｇ",null,null,"▲",null,null,"b",{"$nulls":5},"フォリアミン錠　５ｍｇ"]
["ブスコパン錠　１０ｍｇ",null,null,"▲",null,null,"b",{"$nulls":5},"ブスコパン錠　１０ｍｇ"]
["プラザキサカプセル　１１０ｍｇ","ベーリンガー",null,"×",{"$nulls":3},"g",null,null,"脱カプセルでAUC上昇",null,"プラザキサカプセル　１１０ｍｇ"]
["プラザキサカプセル　７５ｍｇ","ベーリンガー",null,"×",{"$nulls":3},"g",null,null,"脱カプセルでAUC上昇",null,"プラザキサカプセル　７５ｍｇ"]
["フラジール内服錠　２５０ｍｇ",null,null,"●",null,null,"g",{"$nulls":5},"フラジール内服錠　２５０ｍｇ"]
["ブラダロン錠２００ｍｇ",null,null,"▲",null,null,"b",{"$nulls":5},"ブラダロン錠２００ｍｇ"]
["プラノバール",null,null,"▲",null,null,"b",{"$nulls":5},"プラノバール"]
["プラビックス錠２５ｍｇ","サノフィ",null,"▲",null,null,"c",{"$nulls":5},"プラビックス錠２５ｍｇ"]
["プラビックス錠７５ｍｇ","サノフィ",null,"●",null,null,"c",{"$nulls":5},"プラビックス錠７５ｍｇ"]
["プランルカスト錠１１２．５ｍｇ　「ＥＫ」","小林化工",null,"●",{"$nulls":3},"b",null,null,"多めの水でフラッシュ",null,"プランルカスト錠１１２．５ｍｇ　「ＥＫ」"]
["プリジスタナイーブ錠800ｍｇ","ヤンセン",null,"×",{"$nulls":3},"データなし",null,null,"HIV",null,"プリジスタナイーブ錠800ｍｇ"]
["フリバスＯＤ錠２５ｍｇ　",null,null,"●",null,null,"b",{"$nulls":5},"フリバスＯＤ錠２５ｍｇ　"]
["プリモボラン錠５ｍｇ",null,null,"▲",null,null,"b",{"$nulls":5},"プリモボラン錠５ｍｇ"]
["プリンペラン錠　５ｍｇ",null,null,"●",null,null,"b",{"$nulls":5},"プリンペラン錠　５ｍｇ"]
["フルイトラン錠２ｍｇ",null,null,"●",null,null,"b",{"$nulls":5},"フルイトラン錠２ｍｇ"]
["フルコナゾールカプセル１００ｍｇ「サワイ」","沢井",null,"●",null,null,"b",{"$nulls":5},"フルコナゾールカプセル１００ｍｇ「サワイ」"]
["フルダラ錠１０ｍｇ","サノフィ",null,"×",null,null,"b","データなし",null,null,"抗がん剤（フルダラ静注あり）",null,"フルダラ錠１０ｍｇ"]
["フルバスタチン錠30mg「サワイ」","沢井",null,"●",null,null,"b",{"$nulls":5},"フルバスタチン錠30mg「サワイ」"]
["プレタールＯＤ錠　１００ｍｇ","大塚",null,"●",null,null,"b",{"$nulls":5},"プレタールＯＤ錠　１００ｍｇ"]
["ブレディニン錠　５０ｍｇ",null,null,"●",null,null,"b",{"$nulls":5},"ブレディニン錠　５０ｍｇ"]
["プレドニゾロン散「タケダ」　１％",{"$nulls":5},"b",{"$nulls":5},"プレドニゾロン散「タケダ」　１％"]
["プレドニゾロン錠１ｍｇ（旭化成）",null,null,"●",null,null,"b",{"$nulls":5},"プレドニゾロン錠１ｍｇ（旭化成）"]
["プレドニン錠５ｍｇ",null,null,"●",null,null,"b",{"$nulls":5},"プレドニン錠５ｍｇ"]
["プレマリン錠０．６２５ｍｇ",null,null,"▲",null,null,"g",{"$nulls":5},"プレマリン錠０．６２５ｍｇ"]
["プレミネント配合錠ＬＤ","MSD",null,"●",{"$nulls":3},"データなし",{"$nulls":4},"プレミネント配合錠ＬＤ"]
["プログラフカプセル０．５ｍｇ","アステラス",null,"▲",{"$nulls":3},"データなし",{"$nulls":4},"プログラフカプセル０．５ｍｇ"]
["プログラフカプセル１ｍｇ",null,null,"▲",null,null,"b",{"$nulls":5},"プログラフカプセル１ｍｇ"]
["プロサイリン錠２０",null,null,"●",null,null,"b",{"$nulls":5},"プロサイリン錠２０"]
["プロスタ－ル錠２５　２５ｍｇ",null,null,"▲",null,null,"b",{"$nulls":5},"プロスタ－ル錠２５　２５ｍｇ"]
["プロセキソール錠　０．５ｍｇ","あすか",null,"×",{"$nulls":3},"g",null,null,"抗がん剤/10分経過後も変化なし",null,"プロセキソール錠　０．５ｍｇ"]
["プロパジール錠　５０ｍｇ","中外",null,"▲",{"$nulls":3},"g",null,null,"55℃20mL20分放置で懸濁可",null,"プロパジール錠　５０ｍｇ"]
["ブロバリン","日本新薬",{"$nulls":5},"データなし",{"$nulls":4},"ブロバリン"]
["フロベン錠　４０ｍｇ",null,null,"▲",null,null,"b",{"$nulls":5},"フロベン錠　４０ｍｇ"]
["プロマックＤ錠７５",null,null,"×",null,null,"b",{"$nulls":5},"プロマックＤ錠７５"]
["フロモックス小児用細粒１００ｍｇ",{"$nulls":5},"b",{"$nulls":5},"フロモックス小児用細粒１００ｍｇ"]
["フロリネフ錠　０．１ｍｇ",null,null,"●",null,null,"b",{"$nulls":5},"フロリネフ錠　０．１ｍｇ"]
["ベイスンＯＤ錠０．３",null,null,"●",null,null,"b",{"$nulls":5},"ベイスンＯＤ錠０．３"]
["ベゲタミンーＡ配合錠",null,null,"▲",null,null,"g",{"$nulls":5},"ベゲタミンーＡ配合錠"]
["ベゲタミンーＢ配合錠",null,null,"▲",null,null,"g",{"$nulls":5},"ベゲタミンーＢ配合錠"]
["ベサコリン散　５％",{"$nulls":5},"b",{"$nulls":4},"水で溶解（温湯は不可）","ベサコリン散　５％"]
["ベザトールＳＲ錠２００ｍｇ",null,null,"●",null,null,"g",{"$nulls":5},"ベザトールＳＲ錠２００ｍｇ"]
["ベサノイドカプセル　１０ｍｇ",null,null,"×",null,null,"b",{"$nulls":3},"抗がん剤",null,"ベサノイドカプセル　１０ｍｇ"]
["ベシケアＯＤ錠２．５ｍｇ","アステラス",null,"▲",{"$nulls":3},"g",null,null,"有効成分をコーティングしてるものが沈殿しシリンジ内に残留粒子あり",null,"ベシケアＯＤ錠２．５ｍｇ"]
["ベシケアＯＤ錠５ｍｇ","アステラス",null,"●",{"$nulls":3},"g",null,null,"有効成分をコーティングしてるものが沈殿しシリンジ内に残留粒子あり",null,"ベシケアＯＤ錠５ｍｇ"]
["ベタナミン錠１０ｍｇ","三和化学",null,"▲",{"$nulls":3},"b",{"$nulls":4},"ベタナミン錠１０ｍｇ"]
["ベタニス錠５０ｍｇ","アステラス",null,"▲",{"$nulls":3},"g",null,null,"徐放剤",null,"ベタニス錠５０ｍｇ"]
["ベプシドＳ２５　２５ｍｇ","ブリストルマイヤーズ",null,"×",{"$nulls":3},"g",null,null,"抗がん剤（カプセルがシリンジに付着）",null,"ベプシドＳ２５　２５ｍｇ"]
["ヘプセラ錠１０","グラクソ",null,"×",null,null,"b","b",{"$nulls":4},"ヘプセラ錠１０"]
["ベプリコ－ル錠５０ｍｇ",null,null,"▲",null,null,"b",{"$nulls":5},"ベプリコ－ル錠５０ｍｇ"]
["ベラサスＬＡ錠60μｇ","科研",null,"▲",{"$nulls":3},"g",null,null,"薬剤全体が徐放",null,"ベラサスＬＡ錠60μｇ"]
["ペラゾリン細粒　４００ｍｇ　０．５ｇ",{"$nulls":5},"b",{"$nulls":5},"ペラゾリン細粒　４００ｍｇ　０．５ｇ"]
["ベリチーム配合顆粒　１ｇ",{"$nulls":5},"g",{"$nulls":5},"ベリチーム配合顆粒　１ｇ"]
["ペリンドプリル錠４ｍｇ「日医工」","日医工",null,"●",null,null,"b",{"$nulls":5},"ペリンドプリル錠４ｍｇ「日医工」"]
["ペルサンチンＬカプセル　１５０ｍｇ",null,null,"×",null,null,"e",{"$nulls":4},"吸湿性","ペルサンチンＬカプセル　１５０ｍｇ"]
["ペルサンチン錠２５ｍｇ　",null,null,"▲",null,null,"b",{"$nulls":5},"ペルサンチン錠２５ｍｇ　"]
["ベルソムラ錠15ｍｇ","MSD",null,"×",{"$nulls":3},"データなし",{"$nulls":4},"ベルソムラ錠15ｍｇ"]
["ベルソムラ錠20ｍｇ","MSD",null,"×",{"$nulls":3},"データなし",{"$nulls":4},"ベルソムラ錠20ｍｇ"]
["ヘルベッサ－Ｒカプセル１００ｍｇ　",null,null,"●",null,null,"g",{"$nulls":5},"ヘルベッサ－Ｒカプセル１００ｍｇ　"]
["ペルマックス錠２５０μｇ",null,null,"×",null,null,"b",{"$nulls":5},"ペルマックス錠２５０μｇ"]
["ベンザリン錠　５ｍｇ",null,null,"●",null,null,"b",{"$nulls":5},"ベンザリン錠　５ｍｇ"]
["ペンタサ錠　５００ｍｇ",null,null,"▲",null,null,"g",{"$nulls":5},"ペンタサ錠　５００ｍｇ"]
["ホーネル錠　０．３μｇ",null,null,"▲",null,null,"b",{"$nulls":5},"ホーネル錠　０．３μｇ"]
["ホスミシン錠５００ｍｇ",null,null,"▲",null,null,"b",{"$nulls":5},"ホスミシン錠５００ｍｇ"]
["ボルタレンＳＲカプセル　３７．５ｍｇ",null,null,"●",null,null,"e",{"$nulls":5},"ボルタレンＳＲカプセル　３７．５ｍｇ"]
["ボルタレン錠　２５ｍｇ",null,null,"●",null,null,"c",{"$nulls":5},"ボルタレン錠　２５ｍｇ"]
["ポルトラック原末　６ｇ",{"$nulls":5},"b",{"$nulls":5},"ポルトラック原末　６ｇ"]
["ボンゾ－ル錠　２００ｍｇ",null,null,"▲",null,null,"b",{"$nulls":5},"ボンゾ－ル錠　２００ｍｇ"]
["マイスタン錠５ｍｇ",null,null,"▲",null,null,"b",{"$nulls":5},"マイスタン錠５ｍｇ"]
["マイテラ－ゼ　１０ｍｇ",null,null,"▲",null,null,"b",{"$nulls":5},"マイテラ－ゼ　１０ｍｇ"]
["マグラックス錠２５０ｍｇ　",null,null,"×",null,null,"b",{"$nulls":5},"マグラックス錠２５０ｍｇ　"]
["マグラックス錠３３０ｍｇ　",null,null,"×",null,null,"b",{"$nulls":5},"マグラックス錠３３０ｍｇ　"]
["マドパー配合錠",null,null,"●",null,null,"e",{"$nulls":5},"マドパー配合錠"]
["マブリン散　１％",{"$nulls":5},"b",{"$nulls":5},"マブリン散　１％"]
["ミオナール錠５０ｍｇ　",null,null,"●",null,null,"c",{"$nulls":5},"ミオナール錠５０ｍｇ　"]
["ミカルディス錠４０ｍｇ","ベーリンガー",null,"●",{"$nulls":3},"c",{"$nulls":4},"ミカルディス錠４０ｍｇ"]
["ミコブティンカプセル１５０ｍｇ","ファイザー",null,"▲",{"$nulls":3},"データなし",{"$nulls":4},"ミコブティンカプセル１５０ｍｇ"]
["ミコンビ配合錠ＡＰ","ベーリンガー",null,"▲",{"$nulls":3},"データなし",{"$nulls":4},"ミコンビ配合錠ＡＰ"]
["ミニリンメルトＯＤ錠120μｇ","フェリングファーマ",null,"×",null,"g",{"$nulls":6},"ミニリンメルトＯＤ錠120μｇ"]
["ミニリンメルトＯＤ錠60μｇ","フェリングファーマ",null,"×",null,"g",{"$nulls":6},"ミニリンメルトＯＤ錠60μｇ"]
["ミノマイシン顆粒　２０ｍｇ",{"$nulls":5},"b",{"$nulls":5},"ミノマイシン顆粒　２０ｍｇ"]
["ミヤＢＭ細粒　５００ｇ","ミヤリサン",{"$nulls":5},"b",null,null,"賦形剤の沈降炭酸カルシウムが溶け残る可能性あり→上清だけ注入を",null,"ミヤＢＭ細粒　５００ｇ"]
["ミヤＢＭ錠","ミヤリサン",null,"●",{"$nulls":3},"b",null,null,"細粒のデータなし/賦形剤の沈降炭酸カルシウムが溶け残る可能性あり→上清だけ注入を",null,"ミヤＢＭ錠"]
["ミラペックスＬＡ錠０．３７５ｍｇ","ベーリンガー",null,"×",{"$nulls":3},"g",null,"徐放",null,null,"ミラペックスＬＡ錠０．３７５ｍｇ"]
["ミラペックスＬＡ錠１．５ｍｇ","ベーリンガー",null,"×",{"$nulls":3},"g",null,"徐放",null,null,"ミラペックスＬＡ錠１．５ｍｇ"]
["ムコスタ顆粒２０％　０．５ｇ",{"$nulls":5},"b",{"$nulls":5},"ムコスタ顆粒２０％　０．５ｇ"]
["ムコダインＤＳ　５０％　１００Ｇ","杏林",{"$nulls":5},"b",{"$nulls":4},"ムコダインＤＳ　５０％　１００Ｇ"]
["メイアクトＭＳ小児用細粒　１００ｍｇ",{"$nulls":5},"b",{"$nulls":5},"メイアクトＭＳ小児用細粒　１００ｍｇ"]
["メイラックス錠１ｍｇ",null,null,"●",null,null,"b",{"$nulls":5},"メイラックス錠１ｍｇ"]
["メインテート錠０．６２５ｍｇ","田辺三菱",null,"●",{"$nulls":3},"c",{"$nulls":4},"メインテート錠０．６２５ｍｇ"]
["メインテート錠２．５ｍｇ　",null,null,"●",null,null,"c",{"$nulls":5},"メインテート錠２．５ｍｇ　"]
["メキシチールカプセル５０ｍｇ　",null,null,"●",null,null,"b",{"$nulls":5},"メキシチールカプセル５０ｍｇ　"]
["メジコン散　１０％",{"$nulls":5},"b",{"$nulls":5},"メジコン散　１０％"]
["メジコン錠　１５ｍｇ",null,null,"●",null,null,"b",{"$nulls":5},"メジコン錠　１５ｍｇ"]
["メスチノン錠　６０ｍｇ",null,null,"▲",null,null,"b",{"$nulls":5},"メスチノン錠　６０ｍｇ"]
["メソトレキセート錠２．５ｍｇ",null,null,"×",null,null,"g",{"$nulls":3},"抗がん剤",null,"メソトレキセート錠２．５ｍｇ"]
["メタルカプタ－ゼカプセル２００ｍｇ",null,null,"▲",null,null,"b",{"$nulls":5},"メタルカプタ－ゼカプセル２００ｍｇ"]
["メチコバール錠５００μｇ　",null,null,"●",null,null,"b",{"$nulls":5},"メチコバール錠５００μｇ　"]
["メチルエルゴメトリン錠　０．１２５ｍｇ「あすか」　","あすか",null,"▲",null,null,"b",{"$nulls":5},"メチルエルゴメトリン錠　０．１２５ｍｇ「あすか」　"]
["メトグルコ錠　２５０ｍｇ","大日本住友",null,"●",{"$nulls":3},"データなし",{"$nulls":4},"メトグルコ錠　２５０ｍｇ"]
["メトリジン錠２ｍｇ",null,null,"●",null,null,"b",{"$nulls":5},"メトリジン錠２ｍｇ"]
["メトレート錠２ｍｇ","参天",null,"×",null,null,"b",{"$nulls":3},"抗がん剤",null,"メトレート錠２ｍｇ"]
["メドロール錠　４ｍｇ",null,null,"▲",null,null,"b",{"$nulls":5},"メドロール錠　４ｍｇ"]
["メネシット配合錠１００",null,null,"●",null,null,"e",{"$nulls":5},"メネシット配合錠１００"]
["メプチン錠５０μｇ",null,null,"▲",null,null,"b",{"$nulls":5},"メプチン錠５０μｇ"]
["メマリーＯＤ錠20ｍｇ","第一三共",null,"▲",{"$nulls":3},"b",null,null,"55℃以上は凝集物質が生成",null,"メマリーＯＤ錠20ｍｇ"]
["メリスロン錠　６ｍｇ",null,null,"●",null,null,"b",{"$nulls":5},"メリスロン錠　６ｍｇ"]
["メルカゾール錠　５ｍｇ",null,null,"●",null,null,"g",{"$nulls":5},"メルカゾール錠　５ｍｇ"]
["メンドン７．５ｍｇ",null,null,"▲",null,null,"b",{"$nulls":5},"メンドン７．５ｍｇ"]
["モサプリドクエン酸塩錠5mg「日医工」",null,null,"●",null,null,"b",{"$nulls":5},"モサプリドクエン酸塩錠5mg「日医工」"]
["モ－ビック錠１０ｍｇ","ベーリンガー",null,"▲",{"$nulls":3},"データなし",{"$nulls":4},"モ－ビック錠１０ｍｇ"]
["薬用炭",{"$nulls":4},"g",{"$nulls":6},"薬用炭"]
["ユーゼル錠２５ｍｇ","大鵬",null,"▲",null,null,"b",{"$nulls":5},"ユーゼル錠２５ｍｇ"]
["ユーロジン１ｍｇ錠",null,null,"●",null,null,"b",{"$nulls":5},"ユーロジン１ｍｇ錠"]
["ユ－エフティカプセル１００ｍｇ",null,null,"×",null,null,"b",{"$nulls":3},"抗がん剤",null,"ユ－エフティカプセル１００ｍｇ"]
["ユナシン細粒小児用　１００ｍｇ",{"$nulls":5},"g",{"$nulls":5},"ユナシン細粒小児用　１００ｍｇ"]
["ユナシン錠　３７５ｍｇ",null,null,"▲",null,null,"b",{"$nulls":5},"ユナシン錠　３７５ｍｇ"]
["ユニフィルＬＡ錠２００ｍｇ",null,null,"▲",null,null,"g",{"$nulls":5},"ユニフィルＬＡ錠２００ｍｇ"]
["ユベラＮカプセル　１００ｍｇ",null,null,"●",null,null,"b",{"$nulls":5},"ユベラＮカプセル　１００ｍｇ"]
["ユリーフ錠４ｍｇ",null,null,"●",null,null,"b",{"$nulls":5},"ユリーフ錠４ｍｇ"]
["ユリノーム錠５０ｍｇ　",null,null,"●",null,null,"b",{"$nulls":5},"ユリノーム錠５０ｍｇ　"]
["ヨウ化カリウム「日医工」",{"$nulls":5},"b",{"$nulls":5},"ヨウ化カリウム「日医工」"]
["ラシックス２０ｍｇ錠",null,null,"●",null,null,"b",{"$nulls":5},"ラシックス２０ｍｇ錠"]
["ラジレス錠１５０ｍｇ","ノバルティス",null,"×",{"$nulls":3},"データなし",{"$nulls":4},"ラジレス錠１５０ｍｇ"]
["ラックビ－Ｒ（シール）１ｇ",{"$nulls":5},"b",{"$nulls":5},"ラックビ－Ｒ（シール）１ｇ"]
["ラックビー微粒Ｎ　１％　1GX1008包","興和創薬",{"$nulls":5},"g",{"$nulls":4},"ラックビー微粒Ｎ　１％　1GX1008包"]
["ラニラピッド錠　０．１ｍｇ",null,null,"●",null,null,"b",{"$nulls":5},"ラニラピッド錠　０．１ｍｇ"]
["ラフチジン錠10mg「日医工」","日医工",null,"●",null,null,"b",{"$nulls":5},"ラフチジン錠10mg「日医工」"]
["ラベキュアパック４００","エーザイ",null,"×",null,"g",{"$nulls":4},"特殊",null,"ラベキュアパック４００"]
["ラベプラゾールNa塩錠10mg「明治」","Ｍｅｉｊｉ",null,"●",null,null,"g",{"$nulls":3},"腸瘻なら可",null,"ラベプラゾールNa塩錠10mg「明治」"]
["ラミクタール錠１００ｍｇ　","グラクソ",null,"▲",null,null,"b","b",{"$nulls":4},"ラミクタール錠１００ｍｇ　"]
["ラミクタール錠２５ｍｇ　","グラクソ",null,"▲",null,null,"b","b",{"$nulls":4},"ラミクタール錠２５ｍｇ　"]
["ラミクタール錠小児用２ｍｇ　","グラクソ",null,"▲",null,null,"b","b",{"$nulls":4},"ラミクタール錠小児用２ｍｇ　"]
["ラミクタール錠小児用５ｍｇ　","グラクソ",null,"▲",null,null,"b","b",{"$nulls":4},"ラミクタール錠小児用５ｍｇ　"]
["ランソプラゾールOD錠15mg「トーワ」",null,null,"●",null,null,"e",{"$nulls":5},"ランソプラゾールOD錠15mg「トーワ」"]
["リーゼ錠５ｍｇ",null,null,"●",null,null,"b",{"$nulls":5},"リーゼ錠５ｍｇ"]
["リーマス錠２００ｍｇ",null,null,"▲",null,null,"c",{"$nulls":5},"リーマス錠２００ｍｇ"]
["リオレサール錠５ｍｇ",null,null,"●",null,null,"b",{"$nulls":5},"リオレサール錠５ｍｇ"]
["リクシアナ錠60ｍｇ","第一三共",null,"●",{"$nulls":3},"b",{"$nulls":4},"リクシアナ錠60ｍｇ"]
["リザベンカプセル１００ｍｇ",null,null,"▲",null,null,"b",{"$nulls":5},"リザベンカプセル１００ｍｇ"]
["リスパダ－ル錠１ｍｇ",null,null,"●",null,null,"b",{"$nulls":5},"リスパダ－ル錠１ｍｇ"]
["リスミー錠１ｍｇ",null,null,"●",null,null,"b",{"$nulls":5},"リスミー錠１ｍｇ"]
["リズミック錠１０ｍｇ",null,null,"●",null,null,"b",{"$nulls":5},"リズミック錠１０ｍｇ"]
["リ－バクト配合顆粒　４．１５ｇ",{"$nulls":5},"g",{"$nulls":5},"リ－バクト配合顆粒　４．１５ｇ"]
["リパクレオンカプセル１５０ｍｇ","アボット",null,"●",{"$nulls":3},"g",null,null,"胃内で失活",null,"リパクレオンカプセル１５０ｍｇ"]
["リバロ錠２ｍｇ","興和",null,"●",{"$nulls":3},"b",null,null,"光に不安定なので懸濁後30分以内に注入",null,"リバロ錠２ｍｇ"]
["リファジンカプセル　１５０ｍｇ","第一三共",null,"●",{"$nulls":3},"b",null,null,"カプセルの一部がシリンジ付着するが通過には問題なし",null,"リファジンカプセル　１５０ｍｇ"]
["リフレックス錠１５ｍｇ","Ｍｅｉｊｉ",null,"▲",{"$nulls":3},"b",{"$nulls":4},"リフレックス錠１５ｍｇ"]
["リボトリール細粒　０．１％",{"$nulls":5},"b",{"$nulls":5},"リボトリール細粒　０．１％"]
["リボトリール錠０．５ｍｇ",null,null,"●",null,null,"b",{"$nulls":5},"リボトリール錠０．５ｍｇ"]
["リマチル　１００ｍｇ",null,null,"▲",null,null,"g",{"$nulls":5},"リマチル　１００ｍｇ"]
["リマプロストアルファデクス錠５μｇ「F」","富士製薬",null,"×",null,null,"b",{"$nulls":5},"リマプロストアルファデクス錠５μｇ「F」"]
["リリカカプセル２５ｍｇ　","ファイザー",null,"●",{"$nulls":3},"b",null,null,"150mgのデータ参照",null,"リリカカプセル２５ｍｇ　"]
["リリカカプセル７５ｍｇ","ファイザー",null,"●",{"$nulls":3},"b",null,null,"150mgのデータ参照",null,"リリカカプセル７５ｍｇ"]
["リルテック錠　５０ｍｇ",null,null,"▲",null,null,"c",{"$nulls":5},"リルテック錠　５０ｍｇ"]
["リンデロン散　０．１％",{"$nulls":5},"b",{"$nulls":5},"リンデロン散　０．１％"]
["リンデロン錠　０．５ｍｇ",null,null,"●",null,null,"b",{"$nulls":5},"リンデロン錠　０．５ｍｇ"]
["ルーラン錠４ｍｇ",null,null,"▲",null,null,"b",{"$nulls":5},"ルーラン錠４ｍｇ"]
["ルジオミール錠１０ｍｇ",null,null,"▲",null,null,"b",{"$nulls":5},"ルジオミール錠１０ｍｇ"]
["ルセフィ錠2.5ｍｇ","大正富山",null,"▲",{"$nulls":3},"b",{"$nulls":4},"ルセフィ錠2.5ｍｇ"]
["ルネスタ錠1ｍｇ","エーザイ",null,"●",null,null,"g",{"$nulls":5},"ルネスタ錠1ｍｇ"]
["ルプラック錠４ｍｇ",null,null,"●",null,null,"b",{"$nulls":5},"ルプラック錠４ｍｇ"]
["ルボックス錠　２５ｍｇ",null,null,"●",null,null,"c",{"$nulls":5},"ルボックス錠　２５ｍｇ"]
["ルリッド錠１５０",null,null,"▲",null,null,"b",{"$nulls":5},"ルリッド錠１５０"]
["レイアタッツカプセル１５０ｍｇ","ブリストルマイヤーズ",null,"×",null,null,"b",{"$nulls":3},"HIV",null,"レイアタッツカプセル１５０ｍｇ"]
["レキップＣＲ錠２ｍｇ","グラクソ",null,"▲",{"$nulls":3},"b",{"$nulls":4},"レキップＣＲ錠２ｍｇ"]
["レキップ錠０．２５ｍｇ","グラクソ",null,"▲",null,null,"b","b",{"$nulls":4},"レキップ錠０．２５ｍｇ"]
["レキップ錠１ｍｇ","グラクソ",null,"▲",null,null,"b","b",{"$nulls":4},"レキップ錠１ｍｇ"]
["レキップ錠ＣＲ8ｍｇ","グラクソ",null,"▲",{"$nulls":3},"b",{"$nulls":4},"レキップ錠ＣＲ8ｍｇ"]
["レクサプロ錠１０ｍｇ","田辺三菱","持田製薬","▲",{"$nulls":3},"b",{"$nulls":4},"レクサプロ錠１０ｍｇ"]
["レクシヴァ錠７００","ヴィーブ",null,"×",null,null,"c",{"$nulls":3},"HIV",null,"レクシヴァ錠７００"]
["レクチゾール錠２５ｍｇ",null,null,"▲",null,null,"b",{"$nulls":5},"レクチゾール錠２５ｍｇ"]
["レグパラ錠25ｍｇ","協和発酵キリン",null,"●",{"$nulls":3},"b",{"$nulls":4},"レグパラ錠25ｍｇ"]
["レスタミンコーワ錠　１０ｍｇ",null,null,"▲",null,null,"c",{"$nulls":5},"レスタミンコーワ錠　１０ｍｇ"]
["レダマイシンカプセル　１５０ｍｇ",null,null,"▲",null,null,"b",{"$nulls":5},"レダマイシンカプセル　１５０ｍｇ"]
["レトロビルカプセル　１００ｍｇ",null,null,"×",null,null,"b",{"$nulls":3},"HIV",null,"レトロビルカプセル　１００ｍｇ"]
["レナデックス錠　４ｍｇ","セルジーン",null,"▲",{"$nulls":3},"データなし",{"$nulls":4},"レナデックス錠　４ｍｇ"]
["レバチオ錠２０ｍｇ","ファイザー",null,"▲",{"$nulls":3},"b",null,null,"120mlのフラッシュ必要",null,"レバチオ錠２０ｍｇ"]
["レバミピド錠100mg「EMEC」","ＥＭＥＣ","大原","●",null,null,"b","b",{"$nulls":4},"レバミピド錠100mg「EMEC」"]
["レフト－ゼ錠（５０ｍｇ）",null,null,"▲",null,null,"c",{"$nulls":5},"レフト－ゼ錠（５０ｍｇ）"]
["レブラミドカプセル　５ｍｇ","セルジーン",null,"×",{"$nulls":3},"b",null,null,"抗がん剤",null,"レブラミドカプセル　５ｍｇ"]
["レベトールカプセル２００ｍｇ","MSD",null,"▲",{"$nulls":3},"データなし",null,null,"カプセルがゼラチンのため溶解は可だが催奇形性・原薬の刺激性あり",null,"レベトールカプセル２００ｍｇ"]
["レボフロキサシン錠２５０ｍｇ「DSEP]","第一三共エスファ",null,"▲",{"$nulls":3},"c",{"$nulls":4},"レボフロキサシン錠２５０ｍｇ「DSEP]"]
["レボフロキサシン錠５００ｍｇ「DSEP]","第一三共エスファ",null,"●",{"$nulls":3},"c",{"$nulls":4},"レボフロキサシン錠５００ｍｇ「DSEP]"]
["レボレード錠　１２．５ｍｇ","グラクソ",null,"×",{"$nulls":3},"g",null,null,"懸濁するとAUC22％上昇",null,"レボレード錠　１２．５ｍｇ"]
["レミニールＯＤ錠　４ｍｇ","武田","ヤンセン","▲",{"$nulls":3},"データなし",{"$nulls":4},"レミニールＯＤ錠　４ｍｇ"]
["ロイケリン散　１０％",{"$nulls":5},"b",{"$nulls":5},"ロイケリン散　１０％"]
["ロイコボリン錠５ｍｇ","ファイザー",null,"▲",null,null,"b",{"$nulls":5},"ロイコボリン錠５ｍｇ"]
["ロイコン錠１０ｍｇ",null,null,"▲",null,null,"b",{"$nulls":5},"ロイコン錠１０ｍｇ"]
["ロカルトロ－ルカプセル０．５μｇ",null,null,"▲",null,null,"b",{"$nulls":5},"ロカルトロ－ルカプセル０．５μｇ"]
["ロキソプロフェン錠６０ｍｇ　「ＥＭＥＣ」",null,null,"●",null,null,"c",{"$nulls":5},"ロキソプロフェン錠６０ｍｇ　「ＥＭＥＣ」"]
["ロゼレム錠８ｍｇ","武田",null,"●",{"$nulls":3},"c",{"$nulls":4},"ロゼレム錠８ｍｇ"]
["ロペミンカプセル　１ｍｇ　","ヤンセン",null,"●",null,null,"b",{"$nulls":5},"ロペミンカプセル　１ｍｇ　"]
["ロルカム錠４ｍｇ",null,null,"▲",null,null,"b",{"$nulls":5},"ロルカム錠４ｍｇ"]
["ワーファリン錠１ｍｇ",null,null,"●",null,null,"b",{"$nulls":5},"ワーファリン錠１ｍｇ"]
["ワイパックス錠　０．５ｍｇ",null,null,"●",null,null,"b",{"$nulls":5},"ワイパックス錠　０．５ｍｇ"]
["ワカデニン腸溶錠10ｍｇ","わかもと",null,"▲",{"$nulls":3},"データなし",null,null,"胃酸に弱い",null,"ワカデニン腸溶錠10ｍｇ"]
["ワソラン錠４０ｍｇ",null,null,"●",null,null,"c",{"$nulls":5},"ワソラン錠４０ｍｇ"]
["ワンアルファ錠　０．２５μｇ　",null,null,"●",null,null,"b",{"$nulls":5},"ワンアルファ錠　０．２５μｇ　"]
["ワンアルファ錠　１μｇ　",null,null,"●",null,null,"b",{"$nulls":5},"ワンアルファ錠　１μｇ　"]
["塩酸プロカルバジンカプセル　５０ｍｇ","中外",null,"×",null,null,"b",{"$nulls":3},"抗がん剤",null,"塩酸プロカルバジンカプセル　５０ｍｇ"]
["塩酸ミノサイクリンカプセル１００「日医工」","日医工",null,"●",null,null,"b",{"$nulls":3},"色が濃いのでフラッシュ必要",null,"塩酸ミノサイクリンカプセル１００「日医工」"]
["臭化カリウム　１００ｇ","山善",{"$nulls":5},"b",{"$nulls":4},"臭化カリウム　１００ｇ"]
["炭酸水素ナトリウム　５００ｇ「シオエ」","日本新薬","シオエ",{"$nulls":4},"データなし",{"$nulls":4},"炭酸水素ナトリウム　５００ｇ「シオエ」"]
["調剤用パンビタン末","武田",{"$nulls":5},"データなし",{"$nulls":4},"調剤用パンビタン末"]
["乳酸カルシウム「ヨシダ」　",{"$nulls":5},"b",{"$nulls":5},"乳酸カルシウム「ヨシダ」　"]
["乳糖　（粒状）　５００ｇ","健栄",{"$nulls":5},"b",{"$nulls":4},"乳糖　（粒状）　５００ｇ"]
["硫酸ポリミキシンＢ錠100万単位","ファイザ-",null,"▲",null,null,"g",{"$nulls":5},"硫酸ポリミキシンＢ錠100万単位"]

{"sheet":"20150615コメント未","index":5,"n_rows":633,"n_cols":13,"rows_kept":633,"hidden":true}
["2015.2月末の当院採用薬品\na.無し b.懸濁可 c.破壊 d.粉砕　e.条件付 f.懸濁不可 g.懸濁不適",{"$nulls":5},"a.無し b.懸濁可 c.破壊 d.粉砕　e.条件付 f.懸濁不可 g.懸濁不適"]
["薬品名","販売","製造","一包化最終決定","簡易懸濁最終決定","特殊等","ハンドブック","メーカー","他院DB","実験","条件","コメント","薬品名"]
["Ｄ－ソルビトール","丸石",null,null,{"$f":"IF(F3&G3&H3&H3&I3&J3=\"\",\"\",IF(F3&G3&H3&I3=\"\",J3,IF(F3&G3&H3=\"\",I3,(IF(F3&G3=\"\",H3,IF(F3=\"\",G3,F3))))))","v":"g"},{"$nulls":3},"g",null,"14Fr.は可　液の製剤がある様子",null,"Ｄ－ソルビトール"]
["Ｌ－ケフレックス顆粒　５００ｍｇ",{"$nulls":3},"g",null,"g",{"$nulls":5},"Ｌ－ケフレックス顆粒　５００ｍｇ"]
["ＰＬ配合顆粒",{"$nulls":3},"b",null,"b",{"$nulls":5},"ＰＬ配合顆粒"]
["Ｓ・Ｍ散",{"$nulls":3},"b",null,"b",{"$nulls":5},"Ｓ・Ｍ散"]
["アーチスト錠１０ｍｇ",null,null,"●","b",null,"b",{"$nulls":5},"アーチスト錠１０ｍｇ"]
["アーチスト錠２．５ｍｇ","第一三共",null,"●","b",null,null,"b",{"$nulls":4},"アーチスト錠２．５ｍｇ"]
["アーテン錠（２ｍｇ）　",null,null,"▲","b",null,"b",{"$nulls":5},"アーテン錠（２ｍｇ）　"]
["アイセントレス錠４００ｍｇ","MSD",null,"×","g",null,"g",{"$nulls":3},"HIV/破壊し長時間かければ投与可",null,"アイセントレス錠４００ｍｇ"]
["アイトロール錠２０ｍｇ",null,null,"▲","b",null,"b",{"$nulls":5},"アイトロール錠２０ｍｇ"]
["アカルディカプセル１．２５ｍｇ",null,null,"×","b",null,"b",{"$nulls":5},"アカルディカプセル１．２５ｍｇ"]
["アキネトン錠　１ｍｇ",null,null,"▲","b",null,"b",{"$nulls":5},"アキネトン錠　１ｍｇ"]
["アクトス錠１５",null,null,"▲","b",null,"b",{"$nulls":5},"アクトス錠１５"]
["アクトネル錠２．５ｍｇ","エーザイ","味のもと","▲","b",null,null,"b",null,null,"17.5mgのデータ参照",null,"アクトネル錠２．５ｍｇ"]
["アコファイド錠100ｍｇ","ゼリア",null,"▲","b",null,null,"b",{"$nulls":4},"アコファイド錠100ｍｇ"]
["アサコール錠４００ｍｇ","協和発酵キリン","ゼリア","×","g",null,null,"g",null,null,"小腸で吸収",null,"アサコール錠４００ｍｇ"]
["アザルフィジンＥＮ錠　５００ｍｇ",null,null,"▲","c",null,"c",{"$nulls":5},"アザルフィジンＥＮ錠　５００ｍｇ"]
["アシノン錠１５０ｍｇ",null,null,"▲","b",null,"b",{"$nulls":5},"アシノン錠１５０ｍｇ"]
["アジャストＡコーワ錠４０ｍｇ",null,null,"●","b",null,"b",{"$nulls":5},"アジャストＡコーワ錠４０ｍｇ"]
["アジルバ錠４０ｍｇ","武田",null,"●","b",null,null,"b",{"$nulls":4},"アジルバ錠４０ｍｇ"]
["アスパラカリウム散　５０％","田辺製薬販売",null,null,"g","g",{"$nulls":6},"アスパラカリウム散　５０％"]
["アスパラカリウム錠　３００ｍｇ",null,null,"×","g",null,"g",{"$nulls":5},"アスパラカリウム錠　３００ｍｇ"]
["アスピリン","日本新薬","シオエ",null,"b",{"$nulls":3},"b",null,"溶解しないが懸濁状態で通過",null,"アスピリン"]
["アスペノンカプセル１０ｍｇ",null,null,"▲","b",null,"b",{"$nulls":5},"アスペノンカプセル１０ｍｇ"]
["アセチルスピラマイシン錠　２００ｍｇ",null,null,"▲","b",null,"b",{"$nulls":5},"アセチルスピラマイシン錠　２００ｍｇ"]
["アセトアミノフェン「マルイシ」",{"$nulls":3},"e",null,"e",{"$nulls":5},"アセトアミノフェン「マルイシ」"]
["アタラックス－Ｐカプセル２５ｍｇ　",null,null,"●","b",null,"b",{"$nulls":5},"アタラックス－Ｐカプセル２５ｍｇ　"]
["アデホスコーワ顆粒１０％",{"$nulls":3},"g",null,"g",{"$nulls":5},"アデホスコーワ顆粒１０％"]
["アテレック錠　１０ｍｇ",null,null,"●","b",null,"b",{"$nulls":5},"アテレック錠　１０ｍｇ"]
["アドシルカ錠20ｍｇ","リリー","日本新薬","▲","b",{"$nulls":3},"b",{"$nulls":3},"アドシルカ錠20ｍｇ"]
["アドソルビン",{"$nulls":3},"b",null,"b",{"$nulls":5},"アドソルビン"]
["アドナ錠３０ｍｇ　",null,null,"×","b",null,"b",{"$nulls":5},"アドナ錠３０ｍｇ　"]
["アトルバスタチンOD錠10mg「トーワ」","東和",null,"▲","c",null,"c",{"$nulls":5},"アトルバスタチンOD錠10mg「トーワ」"]
["アナフラニール錠１０ｍｇ",null,null,"×","c",null,"c",{"$nulls":5},"アナフラニール錠１０ｍｇ"]
["アフィニトール錠　５ｍｇ","ノバルティス",null,"▲","b",null,"b",{"$nulls":3},"抗がん剤",null,"アフィニトール錠　５ｍｇ"]
["アプレゾリン錠１０ｍｇ　",null,null,"▲","c",null,"c",{"$nulls":5},"アプレゾリン錠１０ｍｇ　"]
["アベロックス錠４００ｍｇ","富士フィルム","バイエル","▲","b",null,"b",{"$nulls":5},"アベロックス錠４００ｍｇ"]
["アボルブカプセル　０．５ｍｇ","グラクソ",null,"▲","g",null,null,"g",null,null,"カプセル内脂溶性液体・口腔内刺激あり",null,"アボルブカプセル　０．５ｍｇ"]
["アマリ－ル１ｍｇ錠",null,null,"×","b",null,"b",{"$nulls":5},"アマリ－ル１ｍｇ錠"]
["アミサリン錠１２５ｍｇ",null,null,"▲","g",null,"g",{"$nulls":5},"アミサリン錠１２５ｍｇ"]
["アミティーザカプセル24μｇ","スキャンポファーマ",null,"▲","b",null,null,"b",{"$nulls":4},"アミティーザカプセル24μｇ"]
["アムノレイク錠２ｍｇ","日本新薬","東光","●","g",{"$nulls":3},"g",null,"抗がん剤",null,"アムノレイク錠２ｍｇ"]
["アムロジピンＯＤ錠5ｍｇ「ＥＭＥＣ」",null,null,"●","b",null,"b",{"$nulls":5},"アムロジピンＯＤ錠5ｍｇ「ＥＭＥＣ」"]
["アメパロモカプセル250ｍｇ","ファイザー",null,"×","g","g",{"$nulls":4},"必要時相談",null,"アメパロモカプセル250ｍｇ"]
["アモキサンカプセル２５ｍｇ",null,null,"▲","b",null,"b",{"$nulls":5},"アモキサンカプセル２５ｍｇ"]
["アモキシシリンカプセル250mg「日医工」","日医工",null,"▲","b",null,"b",{"$nulls":3},"内容物粒子が大きめで大量のため十分なフラッシュを",null,"アモキシシリンカプセル250mg「日医工」"]
["アリセプトＤ錠３ｍｇ",null,null,"▲","b",null,"b",{"$nulls":5},"アリセプトＤ錠３ｍｇ"]
["アリセプトＤ錠５ｍｇ",null,null,"●","b",null,"b",{"$nulls":5},"アリセプトＤ錠５ｍｇ"]
["アリナミンＦ糖衣錠２５ｍｇ　",null,null,"▲","c",null,"c",{"$nulls":5},"アリナミンＦ糖衣錠２５ｍｇ　"]
["アリミデックス錠　１ｍｇ","アストラゼネカ",null,"●","b",null,"b",{"$nulls":3},"抗がん剤",null,"アリミデックス錠　１ｍｇ"]
["アルケラン錠　２ｍｇ",null,null,"●","b",null,"b",{"$nulls":3},"抗がん剤",null,"アルケラン錠　２ｍｇ"]
["アルサルミン細粒　９０％",{"$nulls":3},"b",null,"b",{"$nulls":5},"アルサルミン細粒　９０％"]
["アルダクトンＡ錠　２５ｍｇ　",null,null,"▲","b",null,"b",{"$nulls":5},"アルダクトンＡ錠　２５ｍｇ　"]
["アルドメット錠　２５０ｍｇ",null,null,"×","b",null,"b",{"$nulls":5},"アルドメット錠　２５０ｍｇ"]
["アルファロール散　１μｇ／ｇ","中外",null,null,"b",null,null,"b",{"$nulls":4},"アルファロール散　１μｇ／ｇ"]
["アレセンサカプセル20ｍｇ","中外",null,"▲","b",null,null,"b",null,null,"抗がん剤",null,"アレセンサカプセル20ｍｇ"]
["アレセンサカプセル40ｍｇ","中外",null,"▲","b",null,null,"b",null,null,"抗がん剤",null,"アレセンサカプセル40ｍｇ"]
["アレビアチン散１０％","大日本住友",null,null,"b",{"$nulls":3},"b",{"$nulls":3},"アレビアチン散１０％"]
["アレロック顆粒０．５％","協和発酵キリン",null,null,"g",null,null,"g",{"$nulls":4},"アレロック顆粒０．５％"]
["アロチノロール塩酸塩錠１０ｍｇ「ＤＳＰ」","大日本住友",null,"×","b",null,"b",{"$nulls":5},"アロチノロール塩酸塩錠１０ｍｇ「ＤＳＰ」"]
["アロプリノール錠100ｍｇ「杏林」","杏林",null,"▲","b",null,"b",{"$nulls":5},"アロプリノール錠100ｍｇ「杏林」"]
["アロマシン錠25ｍｇ","ファイザー",null,"▲","b",null,"b",{"$nulls":3},"抗がん剤",null,"アロマシン錠25ｍｇ"]
["アンカロン錠100ｍｇ",null,null,"▲","b",null,"b",{"$nulls":5},"アンカロン錠100ｍｇ"]
["アンコチル錠500ｍｇ",null,null,"▲","b",null,"b",{"$nulls":5},"アンコチル錠500ｍｇ"]
["アンナカ「ヨシダ」",{"$nulls":3},"b",null,"b",{"$nulls":5},"アンナカ「ヨシダ」"]
["アンブロキソール塩酸塩錠15mg「サワイ」","沢井",null,"●",{"$f":"IF(F67&G67&H67&H67&I67&J67=\"\",\"\",IF(F67&G67&H67&I67=\"\",J67,IF(F67&G67&H67=\"\",I67,(IF(F67&G67=\"\",H67,IF(F67=\"\",G67,F67))))))","v":"b"},null,"b",{"$nulls":5},"アンブロキソール塩酸塩錠15mg「サワイ」"]
["アンブロキソール塩酸塩徐放OD錠45mg「サワイ」","沢井",null,"●","b",null,null,"b",{"$nulls":4},"アンブロキソール塩酸塩徐放OD錠45mg「サワイ」"]
["イーケプラ錠250ｍｇ","ＵＣＢ","大塚","●","c",null,"c",{"$nulls":5},"イーケプラ錠250ｍｇ"]
["イーケプラ錠500ｍｇ","ＵＣＢ","大塚","▲","c",null,"c",{"$nulls":5},"イーケプラ錠500ｍｇ"]
["イグザレルト錠10ｍｇ","バイエル",null,"●","b",null,"b",{"$nulls":5},"イグザレルト錠10ｍｇ"]
["イグザレルト錠15ｍｇ","バイエル",null,"▲","b",null,"b",{"$nulls":5},"イグザレルト錠15ｍｇ"]
["イクスタンジカプセル40ｍｇ","アステラス",null,"×","g",null,null,"g",null,null,"抗がん剤/難水性の溶剤を充填",null,"イクスタンジカプセル40ｍｇ"]
["イコサペント酸エチル粒状カプセル９００ｍｇ　「サワイ」",{"$nulls":3},"b",null,"b",{"$nulls":5},"イコサペント酸エチル粒状カプセル９００ｍｇ　「サワイ」"]
["イスコチン錠100ｍｇ",null,null,"●","b",null,"b",{"$nulls":5},"イスコチン錠100ｍｇ"]
["イスコチン末１００％　１００ｇ","第一三共",null,null,"b",{"$nulls":3},"b",{"$nulls":3},"イスコチン末１００％　１００ｇ"]
["イトラコナゾール錠100「ＭＥＥＫ」","Ｍｅｉｊｉ","小林化工","▲","c ",null,null,"c ",{"$nulls":4},"イトラコナゾール錠100「ＭＥＥＫ」"]
["イノベロン錠200ｍｇ","エーザイ",null,"▲","b",null,null,"b",null,null,"沈殿性浮遊物あるが8Fr.通過",null,"イノベロン錠200ｍｇ"]
["イミグラン錠５０","グラクソ",null,"▲","b",null,"b","b",{"$nulls":4},"イミグラン錠５０"]
["イムセラカプセル0.5mg","田辺三菱",null,"×","g","g",{"$nulls":4},"必要時相談",null,"イムセラカプセル0.5mg"]
["イムラン錠50ｍｇ",null,null,"▲","b",null,"b",{"$nulls":5},"イムラン錠50ｍｇ"]
["イメンドカプセル 80ｍｇ","小野",null,"×","g","g",{"$nulls":4},"プロイメンドあり",null,"イメンドカプセル 80ｍｇ"]
["イメンドカプセル125ｍｇ","小野",null,"×","g","g",{"$nulls":4},"プロイメンドあり",null,"イメンドカプセル125ｍｇ"]
["イリボーＯＤ錠５μｇ","アステラス",null,"▲","b",null,null,"b",null,null,"ガラス容器だと吸着",null,"イリボーＯＤ錠５μｇ"]
["イレッサ錠２５０","アストラゼネカ",null,"×","b",null,"b",{"$nulls":3},"抗がん剤",null,"イレッサ錠２５０"]
["インタール細粒１０％","サノフィ",null,null,"b",{"$nulls":3},"b",{"$nulls":3},"インタール細粒１０％"]
["インデラル錠１０ｍｇ",null,null,"▲","b",null,"b",{"$nulls":5},"インデラル錠１０ｍｇ"]
["インフリーＳカプセル２００ｍｇ",null,null,"▲","b",null,"b",{"$nulls":5},"インフリーＳカプセル２００ｍｇ"]
["インライタ錠１ｍｇ","ファイザー",null,"×","g",{"$nulls":3},"g",null,"抗がん剤",null,"インライタ錠１ｍｇ"]
["インライタ錠５ｍｇ","ファイザー",null,"×","g",{"$nulls":3},"g",null,"抗がん剤",null,"インライタ錠５ｍｇ"]
["ヴアイデックスＥＣカプセル１２５　","ブリストルマイヤーズ",null,"×","g",null,"g",{"$nulls":3},"HIV",null,"ヴアイデックスＥＣカプセル１２５　"]
["ヴォトリエント錠200ｍｇ","グラクソ",null,"×","g",null,null,"g",null,null,"抗がん剤/粉砕するとCmax/AUC増加する",null,"ヴォトリエント錠200ｍｇ"]
["ウテメリン　５ｍｇ　",null,null,"▲","b",null,"b",{"$nulls":5},"ウテメリン　５ｍｇ　"]
["ウブレチド錠　５ｍｇ",null,null,"▲","b",null,"b",{"$nulls":5},"ウブレチド錠　５ｍｇ"]
["ウラリット配合錠",null,null,"●","c",null,"c",{"$nulls":5},"ウラリット配合錠"]
["ウリトスＯＤ錠　０．１ｍｇ","杏林",null,"▲","b",null,null,"b",{"$nulls":4},"ウリトスＯＤ錠　０．１ｍｇ"]
["ウルソ錠１００ｍｇ",null,null,"●","b",null,"b",{"$nulls":5},"ウルソ錠１００ｍｇ"]
["ウロカルン錠２２５ｍｇ",null,null,"▲","b",null,"b",{"$nulls":5},"ウロカルン錠２２５ｍｇ"]
["エクア錠　５０ｍｇ","ノバルティス",null,"●","b",{"$nulls":3},"b",{"$nulls":3},"エクア錠　５０ｍｇ"]
["エクジェイド懸濁用５００ｍｇ","ノバルティス",null,"×","g","g",{"$nulls":4},"懸濁に100mL必要",null,"エクジェイド懸濁用５００ｍｇ"]
["エクセグラン散　２０％",{"$nulls":3},"b",null,"b",{"$nulls":5},"エクセグラン散　２０％"]
["エクセグラン錠１００ｍｇ",null,null,"▲","b",null,"b",{"$nulls":5},"エクセグラン錠１００ｍｇ"]
["エジュラント錠25ｍｇ","ヤンセン",null,"×","g","g",{"$nulls":4},"HIV/固形物摂取が必要",null,"エジュラント錠25ｍｇ"]
["エスカゾール錠200ｍｇ","グラクソ",null,"▲","b",null,null,"b",{"$nulls":4},"エスカゾール錠200ｍｇ"]
["エストラサイトカプセル　１５６．７ｍｇ","日新",null,"×","b",null,"b",{"$nulls":3},"冷所",null,"エストラサイトカプセル　１５６．７ｍｇ"]
["エチゾラム錠0.5ｍｇ「ＥＭＥＣ」",null,null,"●","b",null,"b",{"$nulls":5},"エチゾラム錠0.5ｍｇ「ＥＭＥＣ」"]
["エディロールカプセル０．７５μｇ","中外",null,"▲","g",null,null,"g",{"$nulls":4},"エディロールカプセル０．７５μｇ"]
["エナラプリルＭ錠５「ＥＭＥＣ」","エルドメットエーザイ",null,"●","b",null,null,"b",{"$nulls":4},"エナラプリルＭ錠５「ＥＭＥＣ」"]
["エバステル錠１０ｍｇ",null,null,"▲","b",null,"b",{"$nulls":5},"エバステル錠１０ｍｇ"]
["エピビル錠　１５０ｍｇ","グラクソ","ヴィープ","×","b",null,"b","b",null,null,"HIV",null,"エピビル錠　１５０ｍｇ"]
["エビプロスタット配合錠ＤＢ",null,null,"▲","g",null,"g",{"$nulls":5},"エビプロスタット配合錠ＤＢ"]
["エフィエント錠3.75ｍｇ","第一三共",null,"●","e",null,null,"e",null,null,"30℃10分（30分おくのは不可）55℃10分放置は類縁物質増加",null,"エフィエント錠3.75ｍｇ"]
["エフィエント錠5ｍｇ","第一三共",null,"▲","e",null,null,"e",null,null,"30℃10分（30分おくのは不可）55℃10分放置は類縁物質増加",null,"エフィエント錠5ｍｇ"]
["エプジコム錠","ヴィーブ",null,"×","c",null,"c",{"$nulls":3},"HIV",null,"エプジコム錠"]
["エブトール２５０ｍｇ錠　",null,null,"●","g",null,"g",{"$nulls":5},"エブトール２５０ｍｇ錠　"]
["エフピ－ＯＤ錠２．５ｍｇ","エフピー",null,"×","b",null,null,"b",null,null,"覚せい剤原料",null,"エフピ－ＯＤ錠２．５ｍｇ"]
["エブランチルカプセル１５ｍｇ　",null,null,"▲","e",null,"e",{"$nulls":5},"エブランチルカプセル１５ｍｇ　"]
["エリキュース錠（2.5ｍｇ）","ブリストルマイヤーズ",null,"●","b",null,"b",{"$nulls":5},"エリキュース錠（2.5ｍｇ）"]
["エリキュース錠（5ｍｇ）","ブリストルマイヤーズ",null,"●","b",null,"b",{"$nulls":5},"エリキュース錠（5ｍｇ）"]
["エリスロシン錠（２００ｍｇ）",null,null,"▲","c",null,"c",{"$nulls":5},"エリスロシン錠（２００ｍｇ）"]
["エルカルチンFF錠１００ｍｇ","大塚",null,"×","c",null,null,"c",{"$nulls":4},"エルカルチンFF錠１００ｍｇ"]
["エンドキサン錠　５０ｍｇ",null,null,"×","g",null,"g",{"$nulls":3},"抗がん剤",null,"エンドキサン錠　５０ｍｇ"]
["オイグルコン錠１．２５ｍｇ","中外",null,"▲","b",null,"b",{"$nulls":5},"オイグルコン錠１．２５ｍｇ"]
["オーグメンチン配合錠２５０ＲＳ　（３７５ｍｇ）","グラクソ",null,"×","g",null,"g","g",null,null,"吸湿性強い",null,"オーグメンチン配合錠２５０ＲＳ　（３７５ｍｇ）"]
["オ－クル錠　１００ｍｇ",null,null,"▲","c",null,"c",{"$nulls":5},"オ－クル錠　１００ｍｇ"]
["オゼックス細粒小児用１５％","大正富山",null,null,"b",null,null,"b",null,null,"データないが水に溶解するためOKと思われる",null,"オゼックス細粒小児用１５％"]
["オダイン錠　１２５ｍｇ",null,null,"×","b",null,"b",{"$nulls":3},"抗がん剤",null,"オダイン錠　１２５ｍｇ"]
["オラセフ錠　２５０ｍｇ",null,null,"×","b",null,"b",{"$nulls":5},"オラセフ錠　２５０ｍｇ"]
["オルメテック錠２０ｍｇ","第一三共",null,"●","b",null,null,"b",{"$nulls":4},"オルメテック錠２０ｍｇ"]
["オロパタジン塩酸塩ＯＤ錠5mg「明治」","Ｍｅｉｊｉ",null,"●","b",null,"b",{"$nulls":5},"オロパタジン塩酸塩ＯＤ錠5mg「明治」"]
["カイトリル錠２ｍｇ",null,null,"×",{"$f":"IF(F131&G131&H131&H131&I131&J131=\"\",\"\",IF(F131&G131&H131&I131=\"\",J131,IF(F131&G131&H131=\"\",I131,(IF(F131&G131=\"\",H131,IF(F131=\"\",G131,F131))))))","v":"b"},null,"b",{"$nulls":5},"カイトリル錠２ｍｇ"]
["ガスター散１０％　１００ｇ","アステラス",null,null,"b",{"$nulls":3},"b",{"$nulls":3},"ガスター散１０％　１００ｇ"]
["ガステール　４０ｍｇ","扶桑",null,"▲","b",null,"b",{"$nulls":5},"ガステール　４０ｍｇ"]
["ガストローム顆粒　６６．７％",{"$nulls":3},"g",null,"g",{"$nulls":5},"ガストローム顆粒　６６．７％"]
["ガスロンＮ錠４ｍｇ　",null,null,"●","b",null,"b",{"$nulls":5},"ガスロンＮ錠４ｍｇ　"]
["カソデックスＯＤ錠８０ｍｇ",null,null,"×","g",null,"g",{"$nulls":3},"抗がん剤",null,"カソデックスＯＤ錠８０ｍｇ"]
["カタプレス錠７５　０．０７５ｍｇ",null,null,"×","b",null,"b",{"$nulls":5},"カタプレス錠７５　０．０７５ｍｇ"]
["カチーフＮ錠５ｍｇ",null,null,"▲","b",null,"b",{"$nulls":5},"カチーフＮ錠５ｍｇ"]
["ガナトン錠５０ｍｇ",null,null,"●","c",null,"c",{"$nulls":5},"ガナトン錠５０ｍｇ"]
["カナマイシンカプセル明治　２５０ｍｇ",null,null,"▲","b",null,"b",{"$nulls":5},"カナマイシンカプセル明治　２５０ｍｇ"]
["カバサ－ル錠　１ｍｇ",null,null,"▲","b",null,"b",{"$nulls":5},"カバサ－ル錠　１ｍｇ"]
["ガバペン錠２００ｍｇ","ファイザー",null,"▲","c",null,null,"c",null,null,"120mlのフラッシュで残留無し",null,"ガバペン錠２００ｍｇ"]
["ガバペン錠３００ｍｇ","ファイザー",null,"▲","c",null,null,"c",null,null,"180ｍｌのフラッシュで残留無し",null,"ガバペン錠３００ｍｇ"]
["カプトリル錠１２．５ｍｇ","第一三共エスファ",null,"▲","b",{"$nulls":3},"b",{"$nulls":3},"カプトリル錠１２．５ｍｇ"]
["ガランターゼ散　５０％　０．５ｇ","田辺製薬販売",null,null,"g","g",{"$nulls":4},"酵素製剤であり55℃では失活",null,"ガランターゼ散　５０％　０．５ｇ"]
["カルグート錠　５ｍｇ",null,null,"▲","b",null,"b",{"$nulls":5},"カルグート錠　５ｍｇ"]
["カルタンＯＤ錠５００ｍｇ","マイラン",null,"●","b",null,"b",{"$nulls":5},"カルタンＯＤ錠５００ｍｇ"]
["カルデナリン錠１ｍｇ",null,null,"●","b",null,"b",{"$nulls":5},"カルデナリン錠１ｍｇ"]
["カルナクリン錠５０　５０国際単位",null,null,"▲","g",null,"g",{"$nulls":5},"カルナクリン錠５０　５０国際単位"]
["カルブロック錠１６ｍｇ",null,null,"●","c",null,"c",{"$nulls":5},"カルブロック錠１６ｍｇ"]
["カルボシステイン錠250ｍｇ「テバ」","テバ",null,"●","b",null,"b",{"$nulls":5},"カルボシステイン錠250ｍｇ「テバ」"]
["カレトラ配合錠","アッヴィ合同",null,"×","g",null,"g",{"$nulls":3},"HIV",null,"カレトラ配合錠"]
["カロナール錠　２００ｍｇ",null,null,"●","b",null,"b",{"$nulls":5},"カロナール錠　２００ｍｇ"]
["カンデサルタン錠８ｍｇ「あすか」","あすか",null,"●","b",null,null,"b",{"$nulls":4},"カンデサルタン錠８ｍｇ「あすか」"]
["キネダック錠　５０ｍｇ",null,null,"▲","b",null,"b",{"$nulls":5},"キネダック錠　５０ｍｇ"]
["きゅう帰調血飲エキス顆粒","太虎精堂",null,null,"b",null,null,"b",{"$nulls":4},"きゅう帰調血飲エキス顆粒"]
["クエチアピン錠25ｍｇ「ＤＳＥＰ」",null,null,"●","b",null,"b",{"$nulls":5},"クエチアピン錠25ｍｇ「ＤＳＥＰ」"]
["グッドミン錠０．２５ｍｇ",null,null,"●","b",null,"b",{"$nulls":5},"グッドミン錠０．２５ｍｇ"]
["グラケ－カプセル１５ｍｇ　",null,null,"▲","b",null,"b",{"$nulls":5},"グラケ－カプセル１５ｍｇ　"]
["クラシエ十全大補湯エキス細粒",{"$nulls":3},"b",null,"b",{"$nulls":5},"クラシエ十全大補湯エキス細粒"]
["クラシエ当帰芍薬散料エキス細粒　２ｇ","クラシエ",null,null,"b",null,null,"b",{"$nulls":4},"クラシエ当帰芍薬散料エキス細粒　２ｇ"]
["クラシエ半夏厚朴湯","クラシエ",null,null,"b",null,null,"b",{"$nulls":4},"クラシエ半夏厚朴湯"]
["クラシエ芍薬甘草湯エキス細粒",{"$nulls":3},"b",null,"b",{"$nulls":5},"クラシエ芍薬甘草湯エキス細粒"]
["グラマリール錠２５ｍｇ　",null,null,"▲","c",null,"c",{"$nulls":5},"グラマリール錠２５ｍｇ　"]
["クラリシッド錠２００ｍｇ","アボット",null,"▲","b",null,null,"b",null,null,"クラリス同等",null,"クラリシッド錠２００ｍｇ"]
["グランダキシン錠５０ｍｇ　",null,null,"▲","g",null,"g",{"$nulls":5},"グランダキシン錠５０ｍｇ　"]
["グリチロン配合錠",null,null,"●","c",null,"c",{"$nulls":5},"グリチロン配合錠"]
["グリベック錠１００ｍｇ",null,null,"×","b",null,"b",{"$nulls":3},"抗がん剤",null,"グリベック錠１００ｍｇ"]
["グリミクロン錠　４０ｍｇ",null,null,"▲","b",null,"b",{"$nulls":5},"グリミクロン錠　４０ｍｇ"]
["グルコバイ錠５０ｍｇ",null,null,"×","b",null,"b",{"$nulls":5},"グルコバイ錠５０ｍｇ"]
["グルコンサンＫ細粒　４ｍEq/g",{"$nulls":3},"b",null,"b",{"$nulls":5},"グルコンサンＫ細粒　４ｍEq/g"]
["グルファスト錠　１０ｍｇ","キッセイ",null,"▲","b",null,"b",{"$nulls":5},"グルファスト錠　１０ｍｇ"]
["クレストール錠２．５ｍｇ","アストラゼネカ",null,"●","b",{"$nulls":3},"b",{"$nulls":3},"クレストール錠２．５ｍｇ"]
["クレメジンカプセル２００ｍｇ",null,null,"×","e",null,"e",null,null,"○",null,null,"クレメジンカプセル２００ｍｇ"]
["クレメジン細粒分包２ｇ",{"$nulls":3},"e",null,"e",{"$nulls":5},"クレメジン細粒分包２ｇ"]
["ケイキサレート散　５ｇ",{"$nulls":3},"e",null,"e",{"$nulls":5},"ケイキサレート散　５ｇ"]
["ケーサプライ錠600mg","アルフレッサ","佐藤薬品","●","g","g",{"$nulls":4},"徐放",null,"ケーサプライ錠600mg"]
["ケタスカプセル１０ｍｇ",null,null,"▲","b",null,"b",{"$nulls":5},"ケタスカプセル１０ｍｇ"]
["ケフラールカプセル２５０ｍｇ",null,null,"▲","b",null,"b",{"$nulls":5},"ケフラールカプセル２５０ｍｇ"]
["ケフラール細粒小児用１００ｍｇ",{"$nulls":3},"b",null,"b",{"$nulls":5},"ケフラール細粒小児用１００ｍｇ"]
["コデインリン酸塩「タケダ」　１％","武田",null,null,"b",{"$nulls":3},"b",null,"「タケダ」のデータはないが他施設DBでほぼ可となっている",null,"コデインリン酸塩「タケダ」　１％"]
["コ－トリル錠　１０ｍｇ",null,null,"▲","b",null,"b",{"$nulls":5},"コ－トリル錠　１０ｍｇ"]
["コニール錠４",null,null,"●","b",null,"b",{"$nulls":5},"コニール錠４"]
["コペガス錠２００ｍｇ","中外",null,"▲","g",null,null,"g",null,null,"55℃20mL30分放置で懸濁可",null,"コペガス錠２００ｍｇ"]
["コムタン錠１００ｍｇ","ノバルティス",null,"▲","b",null,"b",{"$nulls":5},"コムタン錠１００ｍｇ"]
["コランチル配合顆粒　１ｇ",{"$nulls":3},"b",null,"b",{"$nulls":5},"コランチル配合顆粒　１ｇ"]
["コルヒチン錠「タカタ」　０．５ｍｇ","高田製薬",null,"▲","b",null,"b",{"$nulls":5},"コルヒチン錠「タカタ」　０．５ｍｇ"]
["コレアジン錠12.5ｍｇ","アルフレッサ",null,"▲","b",null,null,"b",{"$nulls":4},"コレアジン錠12.5ｍｇ"]
["コレバインミニ８３％　１．８１ｇ",{"$nulls":3},"g",null,"g",{"$nulls":5},"コレバインミニ８３％　１．８１ｇ"]
["コロネル錠　５００ｍｇ",null,null,"▲","g",null,"g",{"$nulls":5},"コロネル錠　５００ｍｇ"]
["コントール散１％","武田",null,null,"",{"$nulls":7},"コントール散１％"]
["コントミン糖衣錠　１２．５ｍｇ",null,null,"▲","c",null,"c",{"$nulls":5},"コントミン糖衣錠　１２．５ｍｇ"]
["サアミオン錠　５ｍｇ",null,null,"▲","c",null,"c",{"$nulls":5},"サアミオン錠　５ｍｇ"]
["ザイアジェン錠３００ｍｇ","ヴィーブ",null,"×","b",null,"b",{"$nulls":3},"HIV",null,"ザイアジェン錠３００ｍｇ"]
["ザイザル錠５ｍｇ","グラクソ",null,"●",{"$f":"IF(F195&G195&H195&H195&I195&J195=\"\",\"\",IF(F195&G195&H195&I195=\"\",J195,IF(F195&G195&H195=\"\",I195,(IF(F195&G195=\"\",H195,IF(F195=\"\",G195,F195))))))","v":"b"},null,"b","b",{"$nulls":4},"ザイザル錠５ｍｇ"]
["ザイティガ錠250ｍｇ","ヤンセン",null,"×","g",{"$nulls":3},"g",null,"抗がん剤",null,"ザイティガ錠250ｍｇ"]
["サイトテック錠２００",null,null,"▲","b",null,"b",{"$nulls":5},"サイトテック錠２００"]
["ザイボックス錠６００ｍｇ","ファイザー",null,"×","b",null,"b",{"$nulls":5},"ザイボックス錠６００ｍｇ"]
["サイレース錠１ｍｇ　",null,null,"▲","b",null,"b",{"$nulls":5},"サイレース錠１ｍｇ　"]
["サインバルタカプセル２０ｍｇ","リリー","塩野義","▲","g",null,"g",{"$nulls":5},"サインバルタカプセル２０ｍｇ"]
["ザジテンＤＳ　０．１％","ノバルティスファーマ",null,null,"b",{"$nulls":3},"b",null,"表面に白いものが残る",null,"ザジテンＤＳ　０．１％"]
["サムスカ錠１５ｍｇ","大塚",null,"▲","b",null,null,"b",null,null,"口渇を感じない患者は禁忌",null,"サムスカ錠１５ｍｇ"]
["サムスカ錠7.5ｍｇ","大塚",null,"▲","b",null,null,"b",null,null,"口渇を感じない患者は禁忌",null,"サムスカ錠7.5ｍｇ"]
["サラゾピリン錠　５００ｍｇ",null,null,"▲","b",null,"b",{"$nulls":5},"サラゾピリン錠　５００ｍｇ"]
["ザルティア錠5ｍｇ","リリー",null,"▲","b",null,null,"b",{"$nulls":4},"ザルティア錠5ｍｇ"]
["サレドカプセル１００ｍｇ","藤本製薬",null,"×","b",null,"b",{"$nulls":3},"抗がん剤",null,"サレドカプセル１００ｍｇ"]
["サレドカプセル５０ｍｇ","藤本製薬",null,"×","b",null,"b",{"$nulls":3},"抗がん剤",null,"サレドカプセル５０ｍｇ"]
["サワシリン細粒　１００ｍｇ",{"$nulls":3},"b",null,"b",{"$nulls":5},"サワシリン細粒　１００ｍｇ"]
["酸化マグネシウム「シオエ」","日本新薬","シオエ",null,"b",{"$nulls":3},"b",null,"詰まりやすい　マグラックスへ変更推奨",null,"酸化マグネシウム「シオエ」"]
["ザンタック錠　１５０",null,null,"×","c",null,"c",{"$nulls":5},"ザンタック錠　１５０"]
["サンリズムカプセル２５ｍｇ",null,null,"●","b",null,"b",{"$nulls":5},"サンリズムカプセル２５ｍｇ"]
["ジアゾキシドカプセル25ｍｇ「ＭＳＤ」","MSD",null,"▲","g",{"$nulls":3},"g",{"$nulls":3},"ジアゾキシドカプセル25ｍｇ「ＭＳＤ」"]
["シーエルセントリ錠125ｍｇ","ヴィーブ",null,"×","b",null,"b",{"$nulls":3},"HIV",null,"シーエルセントリ錠125ｍｇ"]
["ジェイゾロフト錠２５ｍｇ","ファイザー",null,"▲","g",null,null,"g",null,null,"シリンジ内付着",null,"ジェイゾロフト錠２５ｍｇ"]
["ジェニナック錠２００ｍｇ","大正富山",null,"▲","b",null,null,"b",{"$nulls":4},"ジェニナック錠２００ｍｇ"]
["ジオトリフ錠20ｍｇ","ベーリンガー",null,"×","g","g",{"$nulls":4},"抗がん剤/懸濁液の安定性（55℃10ｍｌ10分）はあるがチューブ通過は確認なし/必要時相談",null,"ジオトリフ錠20ｍｇ"]
["ジオトリフ錠30ｍｇ","ベーリンガー",null,"×","g","g",{"$nulls":4},"抗がん剤/懸濁液の安定性（55℃10ｍｌ10分）はあるがチューブ通過は確認なし/必要時相談",null,"ジオトリフ錠30ｍｇ"]
["ジオトリフ錠40ｍｇ","ベーリンガー",null,"×","g","g",{"$nulls":4},"抗がん剤/懸濁液の安定性（55℃10ｍｌ10分）はあるがチューブ通過は確認なし/必要時相談",null,"ジオトリフ錠40ｍｇ"]
["ジオトリフ錠50ｍｇ","ベーリンガー",null,"×","g","g",{"$nulls":4},"抗がん剤/懸濁液の安定性（55℃10ｍｌ10分）はあるがチューブ通過は確認なし/必要時相談",null,"ジオトリフ錠50ｍｇ"]
["ジゴシン１０００倍散　０．１％","中外",null,null,"b",{"$nulls":3},"b",{"$nulls":3},"ジゴシン１０００倍散　０．１％"]
["ジスロマックカプセル小児用１００ｍｇ",null,null,"▲","b",null,"b",{"$nulls":5},"ジスロマックカプセル小児用１００ｍｇ"]
["ジスロマック細粒　小児用",{"$nulls":3},"b",null,"b",{"$nulls":5},"ジスロマック細粒　小児用"]
["ジスロマック錠２５０ｍｇ　",null,null,"×","b",null,"b",{"$nulls":3},"特殊",null,"ジスロマック錠２５０ｍｇ　"]
["シナール配合顆粒　１ｇ",{"$nulls":3},"b",null,"b",{"$nulls":5},"シナール配合顆粒　１ｇ"]
["ジプレキサ錠２．５ｍｇ","リリー",null,"▲","b",{"$nulls":3},"b",{"$nulls":3},"ジプレキサ錠２．５ｍｇ"]
["シプロキサン錠１００ｍｇ",null,null,"▲","b",null,"b",{"$nulls":5},"シプロキサン錠１００ｍｇ"]
["シベノール錠５０ｍｇ　",null,null,"▲","b",null,"b",{"$nulls":5},"シベノール錠５０ｍｇ　"]
["ジャカビ錠5ｍｇ","ノバルティス",null,"×","g","g",{"$nulls":4},"抗がん剤/必要時相談",null,"ジャカビ錠5ｍｇ"]
["ジャヌビア錠　５０ｍｇ",null,null,"●","b",null,"b",{"$nulls":5},"ジャヌビア錠　５０ｍｇ"]
["ジルテック錠１０","UCジャパン",null,"●","b",null,"b",{"$nulls":5},"ジルテック錠１０"]
["シングレアチュアブル錠５","MSD",null,"×","g",null,null,"g",null,null,"キプレスと同等、不適",null,"シングレアチュアブル錠５"]
["シングレア細粒４ｍｇ","MSD",null,null,"g",null,"g",{"$nulls":3},"キプレス錠不可のため細粒も不可と考えられる",null,"シングレア細粒４ｍｇ"]
["シングレア錠１０　１０ｍｇ","MSD",null,"▲","g",null,null,"g",null,null,"キプレスと同等、不適",null,"シングレア錠１０　１０ｍｇ"]
["シンセロン錠８ｍｇ","杏林",null,"×","b",{"$nulls":3},"b",{"$nulls":3},"シンセロン錠８ｍｇ"]
["シンメトレル細粒１０％",{"$nulls":3},"b",null,"b",{"$nulls":5},"シンメトレル細粒１０％"]
["シンメトレル錠５０ｍｇ",null,null,"▲","b",null,"b",{"$nulls":5},"シンメトレル錠５０ｍｇ"]
["スーテントカプセル１２．５ｍｇ","ファイザー",null,"×","b",null,"b",{"$nulls":3},"抗がん剤",null,"スーテントカプセル１２．５ｍｇ"]
["スタラシドカプセル５０ｍｇ","日本化薬",null,"×","b",null,"b",{"$nulls":3},"抗がん剤",null,"スタラシドカプセル５０ｍｇ"]
["スタリビルド配合錠","日本たばこ産業",null,"×","e",null,null,"e",null,null,"HIV/常温で",null,"スタリビルド配合錠"]
["スチバーガ錠40ｍｇ","バイエル",null,"×","g",{"$nulls":3},"g",null,"抗がん剤",null,"スチバーガ錠40ｍｇ"]
["ストックリン錠２００ｍｇ","MSD",null,"×","g",null,"g",{"$nulls":3},"HIV　600mg参照",null,"ストックリン錠２００ｍｇ"]
["ストックリン錠６００ｍｇ","MSD",null,"×","g",null,"g",{"$nulls":3},"HIV",null,"ストックリン錠６００ｍｇ"]
["ストロメクトール錠　３ｍｇ","マルホ","MSD","▲","b",null,"b",{"$nulls":5},"ストロメクトール錠　３ｍｇ"]
["ズファジラン錠10ｍｇ","第一三共",null,"▲","b",null,"b",{"$nulls":5},"ズファジラン錠10ｍｇ"]
["スプリセル錠２０ｍｇ","ブリストルマイヤーズ",null,"×","b",null,"b",{"$nulls":3},"抗がん剤",null,"スプリセル錠２０ｍｇ"]
["スンベプラカプセル100ｍｇ","ブリストルマイヤーズ",null,"×","g",{"$nulls":3},"g",null,"油の液体軟カプセルのため不可",null,"スンベプラカプセル100ｍｇ"]
["セイブル錠　５０ｍｇ","三和化学",null,"▲","c",null,null,"c",{"$nulls":4},"セイブル錠　５０ｍｇ"]
["ゼチーア錠１０ｍｇ","MSD",null,"●","b",{"$nulls":3},"b",null,"原薬は脂溶性",null,"ゼチーア錠１０ｍｇ"]
["セディ－ル錠１０ｍｇ",null,null,"▲","b",null,"b",{"$nulls":5},"セディ－ル錠１０ｍｇ"]
["セパゾン錠２",null,null,"▲","b",null,"b",{"$nulls":5},"セパゾン錠２"]
["セファドール錠　２５ｍｇ　",null,null,"●","b",null,"b",{"$nulls":5},"セファドール錠　２５ｍｇ　"]
["セフカペンピボキシル塩酸塩錠100mg「ファイザー」","マイラン",null,"×","b",null,null,"b",null,null,"残留粒子あるが押し込める",null,"セフカペンピボキシル塩酸塩錠100mg「ファイザー」"]
["セフジニル錠100mg「サワイ」","沢井",null,"●","b",null,"b",{"$nulls":5},"セフジニル錠100mg「サワイ」"]
["セフゾン細粒小児用１０％　２００ｇ",{"$nulls":3},"b",null,"b",{"$nulls":5},"セフゾン細粒小児用１０％　２００ｇ"]
["セララ錠２５ｍｇ","ファイザー",null,"●","b",null,"b",{"$nulls":5},"セララ錠２５ｍｇ"]
["ゼリットカプセル　１５ｍｇ","ブリストルマイヤーズ",null,"×","b",null,"b",{"$nulls":3},"HIV",null,"ゼリットカプセル　１５ｍｇ"]
["ゼリットカプセル２０ｍｇ","ブリストルマイヤーズ",null,"×","b",null,"b",{"$nulls":3},"HIV",null,"ゼリットカプセル２０ｍｇ"]
["セルシン錠　２ｍｇ",null,null,"●","b",null,"b",{"$nulls":5},"セルシン錠　２ｍｇ"]
["セルセプトカプセル250ｍｇ","中外",null,"▲",{"$f":"IF(F259&G259&H259&H259&I259&J259=\"\",\"\",IF(F259&G259&H259&I259=\"\",J259,IF(F259&G259&H259=\"\",I259,(IF(F259&G259=\"\",H259,IF(F259=\"\",G259,F259))))))","v":"b"},null,null,"b",{"$nulls":4},"セルセプトカプセル250ｍｇ"]
["セレキノン錠　１００ｍｇ",null,null,"▲","g",null,"g",{"$nulls":5},"セレキノン錠　１００ｍｇ"]
["セレクト－ル錠２００ｍｇ",null,null,"▲","c",null,"c",{"$nulls":5},"セレクト－ル錠２００ｍｇ"]
["セレコックス錠１００ｍｇ","アステラス",null,"●","c",null,null,"c",{"$nulls":4},"セレコックス錠１００ｍｇ"]
["セレジスト錠５ｍｇ",null,null,"▲","b",null,"b",{"$nulls":5},"セレジスト錠５ｍｇ"]
["セレスタミン配合錠",null,null,"▲","b",null,"b",{"$nulls":5},"セレスタミン配合錠"]
["セレニカＲ顆粒　４０％",{"$nulls":3},"g",null,"g",{"$nulls":5},"セレニカＲ顆粒　４０％"]
["セレネース錠　０．７５ｍｇ",null,null,"●","b",null,"b",{"$nulls":5},"セレネース錠　０．７５ｍｇ"]
["ゼローダ錠３００　","中外",null,"×","b",null,"b",{"$nulls":3},"抗がん剤",null,"ゼローダ錠３００　"]
["セロクラール錠　１０ｍｇ","日医工",null,"▲","g",null,null,"g",null,null,"20mg錠のデータ参照",null,"セロクラール錠　１０ｍｇ"]
["セロケン錠２０ｍｇ",null,null,"▲","b",null,"b",{"$nulls":5},"セロケン錠２０ｍｇ"]
["セロトーン錠１０ｍｇ",null,null,"×","b",null,"b",{"$nulls":5},"セロトーン錠１０ｍｇ"]
["センノサイド錠（大正薬品）　１２ｍｇ",null,null,"●","c",null,"c",{"$nulls":5},"センノサイド錠（大正薬品）　１２ｍｇ"]
["ソセゴン錠２５ｍｇ","丸石",null,"×","g","g",{"$nulls":4},"向精神薬2種 ソセゴン注あり",null,"ソセゴン錠２５ｍｇ"]
["ソタコール錠４０ｍｇ","ブリストルマイヤーズ",null,"▲","b",null,null,"b",{"$nulls":4},"ソタコール錠４０ｍｇ"]
["ゾビラックス錠　２００ｍｇ",null,null,"▲","b",null,"b",{"$nulls":5},"ゾビラックス錠　２００ｍｇ"]
["ソブリアードカプセル100ｍｇ","ヤンセン",null,"×","g",{"$nulls":3},"g",null,"データなし　症例あった時に要相談",null,"ソブリアードカプセル100ｍｇ"]
["ソラナックス０．４ｍｇ錠",null,null,"●","b",null,"b",{"$nulls":5},"ソラナックス０．４ｍｇ錠"]
["ソランタール錠１００ｍｇ",null,null,"▲","c",null,"c",{"$nulls":5},"ソランタール錠１００ｍｇ"]
["ゾルピデム酒石酸塩OD錠5mg「サワイ」","沢井",null,"●","b",null,"b",{"$nulls":5},"ゾルピデム酒石酸塩OD錠5mg「サワイ」"]
["ダイアート錠６０ｍｇ",null,null,"●","b",null,"b",{"$nulls":5},"ダイアート錠６０ｍｇ"]
["ダイアモックス錠２５０ｍｇ",null,null,"▲","b",null,"b",{"$nulls":5},"ダイアモックス錠２５０ｍｇ"]
["タイケルブ錠　２５０ｍｇ","グラクソ",null,"×","b",null,"b","b",null,null,"抗がん剤",null,"タイケルブ錠　２５０ｍｇ"]
["タウリン散９８％「大正」",{"$nulls":3},"e",null,"e",{"$nulls":5},"タウリン散９８％「大正」"]
["ダグルインザ錠60ｍｇ","ブリストルマイヤーズ",null,"×","g",{"$nulls":3},"g",{"$nulls":3},"ダグルインザ錠60ｍｇ"]
["タシグナカプセル１５０ｍｇ","ノバルティス",null,"×","b",null,"b",{"$nulls":3},"抗がん剤",null,"タシグナカプセル１５０ｍｇ"]
["タシグナカプセル２００ｍｇ","ノバルティス",null,"×","b",null,"b",{"$nulls":3},"抗がん剤",null,"タシグナカプセル２００ｍｇ"]
["タナド－パ顆粒　１ｇ",{"$nulls":3},"g",null,"g",{"$nulls":5},"タナド－パ顆粒　１ｇ"]
["タナトリル錠５",null,null,"●","c",null,"c",{"$nulls":5},"タナトリル錠５"]
["タミフルカプセル７５ｍｇ",null,null,"×","b",null,"b",{"$nulls":5},"タミフルカプセル７５ｍｇ"]
["タミフルドライシロップ３％","中外",null,null,"b",{"$nulls":3},"b",{"$nulls":3},"タミフルドライシロップ３％"]
["ダラシンカプセル　１５０ｍｇ",null,null,"●","b",null,"b",{"$nulls":5},"ダラシンカプセル　１５０ｍｇ"]
["タリオン錠１０　１０ｍｇ","田辺三菱",null,"●","g",null,null,"g",{"$nulls":4},"タリオン錠１０　１０ｍｇ"]
["タルセバ錠１００ｍｇ","中外",null,"×","b",null,"b",{"$nulls":3},"抗がん剤",null,"タルセバ錠１００ｍｇ"]
["タルセバ錠１５０ｍｇ","中外",null,"×","b",null,"b",{"$nulls":3},"抗がん剤",null,"タルセバ錠１５０ｍｇ"]
["タルセバ錠２５ｍｇ","中外",null,"×","b",null,"b",{"$nulls":3},"抗がん剤",null,"タルセバ錠２５ｍｇ"]
["ダントリウムカプセル２５",null,null,"▲","b",null,"b",{"$nulls":5},"ダントリウムカプセル２５"]
["タンニン酸アルブミン","日本新薬","シオエ",null,"e",null,null,"e",null,null,"55℃では凝固するため常温の水で懸濁",null,"タンニン酸アルブミン"]
["タンボコ－ル錠　５０ｍｇ",null,null,"▲","b",null,"b",{"$nulls":5},"タンボコ－ル錠　５０ｍｇ"]
["チザニジン錠1mg「サワイ」","沢井",null,"▲","b",null,"b",{"$nulls":5},"チザニジン錠1mg「サワイ」"]
["チャンピックス錠０．５ｍｇ","ファイザー",null,"×","b",null,null,"b",null,null,"フラッシュ120ｍｌ必要（ガストロは詰まるかも）",null,"チャンピックス錠０．５ｍｇ"]
["チャンピックス錠１ｍｇ","ファイザー",null,"×","b",null,null,"b",null,null,"フラッシュ120ｍｌ必要（ガストロは詰まるかも）",null,"チャンピックス錠１ｍｇ"]
["チラ－ヂンＳ錠５０",null,null,"●","c",null,"c",{"$nulls":5},"チラ－ヂンＳ錠５０"]
["チロナミン錠　５μｇ",null,null,"●","b",null,"b",{"$nulls":5},"チロナミン錠　５μｇ"]
["ツムラ葛根湯エキス顆粒（医療用）",{"$nulls":3},"b",null,"b",{"$nulls":5},"ツムラ葛根湯エキス顆粒（医療用）"]
["ツムラ五苓散エキス顆粒（医療用）",{"$nulls":3},"b",null,"b",{"$nulls":5},"ツムラ五苓散エキス顆粒（医療用）"]
["ツムラ清心蓮子飲エキス顆粒",{"$nulls":3},"b",null,"b",{"$nulls":5},"ツムラ清心蓮子飲エキス顆粒"]
["ツムラ大建中湯エキス顆粒",{"$nulls":3},"b",null,"b",{"$nulls":5},"ツムラ大建中湯エキス顆粒"]
["ツムラ猪苓湯エキス顆粒",{"$nulls":3},"b",null,"b",{"$nulls":5},"ツムラ猪苓湯エキス顆粒"]
["ツムラ麦門冬湯エキス顆粒",{"$nulls":3},"b",null,"b",{"$nulls":5},"ツムラ麦門冬湯エキス顆粒"]
["ツムラ八味地黄丸エキス顆粒（医療用）",{"$nulls":3},"b",null,"b",{"$nulls":5},"ツムラ八味地黄丸エキス顆粒（医療用）"]
["ツムラ半夏瀉心湯エキス",{"$nulls":3},"b",null,"b",{"$nulls":5},"ツムラ半夏瀉心湯エキス"]
["ツムラ補中益気湯エキス顆粒",{"$nulls":3},"b",null,"b",{"$nulls":5},"ツムラ補中益気湯エキス顆粒"]
["ツムラ抑肝散エキス顆粒（２．５ｇ/包）",{"$nulls":3},"b",null,"b",{"$nulls":5},"ツムラ抑肝散エキス顆粒（２．５ｇ/包）"]
["ツムラ六君子湯エキス顆粒　１８９包",{"$nulls":3},"b",null,"b",{"$nulls":5},"ツムラ六君子湯エキス顆粒　１８９包"]
["ティーエスワン配合OD錠T20",null,null,"×","b",null,"b",{"$nulls":3},"抗がん剤",null,"ティーエスワン配合OD錠T20"]
["ティーエスワン配合OD錠T25",null,null,"×","b",null,"b",{"$nulls":3},"抗がん剤",null,"ティーエスワン配合OD錠T25"]
["ティ－エスワン配合顆粒T２０",{"$nulls":3},"b",null,"b",{"$nulls":5},"ティ－エスワン配合顆粒T２０"]
["ティ－エスワン配合顆粒T２５","大鵬",null,null,"b",null,null,"b",{"$nulls":4},"ティ－エスワン配合顆粒T２５"]
["テオロング錠１００ｍｇ",null,null,"●","b",null,"b",{"$nulls":5},"テオロング錠１００ｍｇ"]
["テオロング錠２００ｍｇ",null,null,"▲","b",null,"b",{"$nulls":5},"テオロング錠２００ｍｇ"]
["デカドロン錠　０．５ｍｇ",null,null,"●","b",null,"b",{"$nulls":5},"デカドロン錠　０．５ｍｇ"]
["テグレトール細粒　５０％",{"$nulls":3},"b",null,"b",{"$nulls":5},"テグレトール細粒　５０％"]
["テグレトール錠　２００ｍｇ",null,null,"●","b",null,"b",{"$nulls":5},"テグレトール錠　２００ｍｇ"]
["テシプール錠　１ｍｇ",null,null,"▲",{"$f":"IF(F323&G323&H323&H323&I323&J323=\"\",\"\",IF(F323&G323&H323&I323=\"\",J323,IF(F323&G323&H323=\"\",I323,(IF(F323&G323=\"\",H323,IF(F323=\"\",G323,F323))))))","v":"b"},null,"b",{"$nulls":5},"テシプール錠　１ｍｇ"]
["デジレル錠２５",null,null,"▲","c",null,"c",{"$nulls":5},"デジレル錠２５"]
["テネリア錠20ｍｇ","田辺",null,"▲","c",null,null,"c",{"$nulls":4},"テネリア錠20ｍｇ"]
["テノーミン　５０ｍｇ",null,null,"▲","b",null,"b",{"$nulls":5},"テノーミン　５０ｍｇ"]
["テノゼット錠300ｍｇ","グラクソ",null,"▲","b",null,null,"b",{"$nulls":4},"テノゼット錠300ｍｇ"]
["デノタスチュアブル配合錠","第一三共",null,"×","c",null,null,"c",null,null,"55℃20mL20回以上破壊して10分で懸濁可",null,"デノタスチュアブル配合錠"]
["デパケンＲ錠１００",null,null,"▲","g",null,"g",{"$nulls":5},"デパケンＲ錠１００"]
["デパケンＲ錠２００",null,null,"●","g",null,"g",{"$nulls":5},"デパケンＲ錠２００"]
["テビケイ錠50ｍｇ","ヴィーブ",null,"×","g","g",{"$nulls":4},"HIV/データないが簡易懸濁必要ないと思われる",null,"テビケイ錠50ｍｇ"]
["テプレノンカプセル50ｍｇ「トーワ」","東和",null,"●","b",null,"b",{"$nulls":5},"テプレノンカプセル50ｍｇ「トーワ」"]
["テモカプリル塩酸塩錠２ｍｇ「タカタ」","高田",null,"●","b",null,"b",{"$nulls":5},"テモカプリル塩酸塩錠２ｍｇ「タカタ」"]
["テモダールカプセル１００ｍｇ","MSD",null,"×","b",null,"b",{"$nulls":3},"抗がん剤",null,"テモダールカプセル１００ｍｇ"]
["テモダールカプセル２０ｍｇ","MSD",null,"×","b",null,"b",{"$nulls":3},"抗がん剤",null,"テモダールカプセル２０ｍｇ"]
["ドグマチール錠５０ｍｇ",null,null,"●","b",null,"b",{"$nulls":5},"ドグマチール錠５０ｍｇ"]
["ドパストン散９８．５％",{"$nulls":3},"b",null,"b",{"$nulls":5},"ドパストン散９８．５％"]
["トビエース錠4ｍｇ","ファイザー",null,"×","g",null,null,"g",null,null,"徐放",null,"トビエース錠4ｍｇ"]
["トピナ細粒１０％","協和発酵キリン",null,null,"b",null,null,"b",{"$nulls":4},"トピナ細粒１０％"]
["トピナ錠５０ｍｇ","協和発酵キリン",null,"▲","b",null,null,"b",{"$nulls":4},"トピナ錠５０ｍｇ"]
["ドプスOD錠２００ｍｇ","大日本住友",null,"●","e",null,null,"e",null,null,"ドパミン製剤のため酸化マグネシウムと同時懸濁しない",null,"ドプスOD錠２００ｍｇ"]
["ドプス細粒　２０％","大日本住友",null,null,"g","g",{"$nulls":4},"OD錠に変更",null,"ドプス細粒　２０％"]
["トフラニール錠１０ｍｇ",null,null,"▲","g",null,"g",{"$nulls":5},"トフラニール錠１０ｍｇ"]
["ドミン錠",null,null,"▲","b",null,"b",{"$nulls":5},"ドミン錠"]
["トラクリア錠６２．５ｍｇ","アクテリオンファーマ",null,"▲","b",null,null,"b",{"$nulls":4},"トラクリア錠６２．５ｍｇ"]
["トラゼンタ錠5ｍｇ","ベーリンガー",null,"▲","b",{"$nulls":3},"b",{"$nulls":3},"トラゼンタ錠5ｍｇ"]
["トラベルミン配合錠",null,null,"●","c",null,"c",{"$nulls":5},"トラベルミン配合錠"]
["トラマールOD錠２５ｍｇ","ファイザー",null,"●","b",null,null,"b",{"$nulls":4},"トラマールOD錠２５ｍｇ"]
["トラムセット配合錠","持田製薬","ヤンセン","●","b",{"$nulls":3},"b",{"$nulls":3},"トラムセット配合錠"]
["ドラ－ル錠１５　１５ｍｇ",null,null,"▲","b",null,"b",{"$nulls":5},"ドラ－ル錠１５　１５ｍｇ"]
["トランサミンカプセル　２５０ｍｇ",null,null,"●","b",null,"b",{"$nulls":5},"トランサミンカプセル　２５０ｍｇ"]
["トリアゾラム錠０．１２５ｍｇ「テバ」","テバ",null,"●","b",null,"b",{"$nulls":5},"トリアゾラム錠０．１２５ｍｇ「テバ」"]
["トリプタノ－ル錠　１０ｍｇ",null,null,"●","b",null,"b",{"$nulls":5},"トリプタノ－ル錠　１０ｍｇ"]
["トレドミン錠２５　２５ｍｇ",null,null,"▲","b",null,"b",{"$nulls":5},"トレドミン錠２５　２５ｍｇ"]
["トロペロン錠1ｍｇ",null,null,"▲","b",null,"b",{"$nulls":5},"トロペロン錠1ｍｇ"]
["ドンペリドン錠１０ｍｇ　「ＥＭＥＣ」",null,null,"●","b",null,"b",{"$nulls":5},"ドンペリドン錠１０ｍｇ　「ＥＭＥＣ」"]
["ナイキサン錠　１００ｍｇ",null,null,"●","b",null,"b",{"$nulls":5},"ナイキサン錠　１００ｍｇ"]
["ニコチン酸アミド散ゾンネ　１０％",{"$nulls":3},"b",null,"b",{"$nulls":5},"ニコチン酸アミド散ゾンネ　１０％"]
["ニコランジル錠5mg「日医工」","日医工",null,"●","b",null,"b",{"$nulls":5},"ニコランジル錠5mg「日医工」"]
["ニッパスカルシウム顆粒１００％","田辺三菱",null,null,"g","g",{"$nulls":4},"必要時相談",null,"ニッパスカルシウム顆粒１００％"]
["ニトロール錠　５ｍｇ",null,null,"▲","b",null,"b",{"$nulls":5},"ニトロール錠　５ｍｇ"]
["ニトロペン舌下錠　０．３ｍｇ","日本化薬",null,"×","g","g",{"$nulls":4},"特殊",null,"ニトロペン舌下錠　０．３ｍｇ"]
["ニバジール錠２ｍｇ",null,null,"▲","b",null,"b",{"$nulls":5},"ニバジール錠２ｍｇ"]
["ニフェジピンCR錠２０ｍｇ「日医工」","日医工",null,"●","g","g",{"$nulls":4},"徐放",null,"ニフェジピンCR錠２０ｍｇ「日医工」"]
["ニポラジン錠　３ｍｇ　",null,null,"▲","b",null,"b",{"$nulls":5},"ニポラジン錠　３ｍｇ　"]
["ニュ－ロタン錠　５０ｍｇ",null,null,"●","c",null,"c",{"$nulls":5},"ニュ－ロタン錠　５０ｍｇ"]
["ネオマレルミンＴＲ錠6ｍｇ","テバ",null,"●","g",null,"g",{"$nulls":5},"ネオマレルミンＴＲ錠6ｍｇ"]
["ネオ－ラル２５ｍｇ",null,null,"×","b",null,"b",{"$nulls":3},"特殊",null,"ネオ－ラル２５ｍｇ"]
["ネキシウムカプセル２０ｍｇ",null,null,"●","b",null,"b",{"$nulls":5},"ネキシウムカプセル２０ｍｇ"]
["ネクサバール錠２００ｍｇ","バイエル",null,"×","g",null,"g",{"$nulls":3},"抗がん剤",null,"ネクサバール錠２００ｍｇ"]
["ネシーナ錠　１２．５ｍｇ","武田",null,"●","c",null,null,"c",{"$nulls":4},"ネシーナ錠　１２．５ｍｇ"]
["ノイエルカプセル　２００ｍｇ",null,null,"●","b",null,"b",{"$nulls":5},"ノイエルカプセル　２００ｍｇ"]
["ノイキノン錠１０ｍｇ　",null,null,"●","b",null,"b",{"$nulls":5},"ノイキノン錠１０ｍｇ　"]
["ノイロトロピン錠　４単位　",null,null,"▲","g",null,"g",{"$nulls":5},"ノイロトロピン錠　４単位　"]
["ノウリアスト錠20ｍｇ","協和発酵キリン",null,"▲","b",null,null,"b",null,null,"光に不安定",null,"ノウリアスト錠20ｍｇ"]
["ノバミン錠５ｍｇ",null,null,"●","b",null,"b",{"$nulls":5},"ノバミン錠５ｍｇ"]
["ノ－ビア錠１００ｍｇ","アッヴィ",null,"×","g",null,null,"g",null,null,"HIV　カレトラ粉砕によりリトナビルのAUCが39%低下したため不適",null,"ノ－ビア錠１００ｍｇ"]
["ノルバデックス錠２０ｍｇ",null,null,"×","b",null,"b",{"$nulls":3},"抗がん剤",null,"ノルバデックス錠２０ｍｇ"]
["パーロデル２．５ｍｇ",null,null,"▲","g",null,"g",{"$nulls":5},"パーロデル２．５ｍｇ"]
["バイアスピリン",null,null,"●","g",null,"g",{"$nulls":5},"バイアスピリン"]
["バイカロン錠　２５ｍｇ",null,null,"▲","b",null,"b",{"$nulls":5},"バイカロン錠　２５ｍｇ"]
["バイシリンＧ顆粒４０万単位",{"$nulls":3},"b",null,"b",{"$nulls":5},"バイシリンＧ顆粒４０万単位"]
["ハイドレアカプセル",null,null,"×","b",null,"b",{"$nulls":3},"抗がん剤",null,"ハイドレアカプセル"]
["ハイペン錠200ｍｇ　",null,null,"●","b",null,"b",{"$nulls":5},"ハイペン錠200ｍｇ　"]
["パキシルCR錠12.5ｍｇ","グラクソ",null,"▲","g",null,null,"g",{"$nulls":4},"パキシルCR錠12.5ｍｇ"]
["バクタ配合錠",null,null,"●","b",null,"b",{"$nulls":5},"バクタ配合錠"]
["バップフォ－錠10ｍｇ",null,null,"▲",{"$f":"IF(F387&G387&H387&H387&I387&J387=\"\",\"\",IF(F387&G387&H387&I387=\"\",J387,IF(F387&G387&H387=\"\",I387,(IF(F387&G387=\"\",H387,IF(F387=\"\",G387,F387))))))","v":"b"},null,"b",{"$nulls":5},"バップフォ－錠10ｍｇ"]
["パナルジン錠100ｍｇ",null,null,"▲","c",null,"c",{"$nulls":5},"パナルジン錠100ｍｇ"]
["バファリン配合錠Ａ330",null,null,"×","b",null,"b",{"$nulls":5},"バファリン配合錠Ａ330"]
["バラクルード錠０．５ｍｇ","ブリストルマイヤーズ",null,"×","b",null,null,"b",{"$nulls":4},"バラクルード錠０．５ｍｇ"]
["バルサルタン錠80ｍｇ「サンド」","サンド",null,"●","b",null,null,"b",{"$nulls":4},"バルサルタン錠80ｍｇ「サンド」"]
["バルトレックス錠500ｍｇ","グラクソ",null,"▲","c",null,"c",{"$nulls":5},"バルトレックス錠500ｍｇ"]
["バルトレックス顆粒５０％","グラクソ",null,null,"g",null,null,"g",{"$nulls":4},"バルトレックス顆粒５０％"]
["ハルナールＤ錠0.2ｍｇ",null,null,"●","b",null,"b",{"$nulls":5},"ハルナールＤ錠0.2ｍｇ"]
["バレイショデンプン","日本新薬","シオエ",null,"",{"$nulls":7},"バレイショデンプン"]
["パントシン錠100",null,null,"▲","g",null,"g",{"$nulls":5},"パントシン錠100"]
["ビ・シフロール錠0.125ｍｇ","ブリストルマイヤーズ",null,"▲","b",{"$nulls":3},"b",{"$nulls":3},"ビ・シフロール錠0.125ｍｇ"]
["ビ・シフロール錠0.5ｍｇ","ブリストルマイヤーズ",null,"▲","b",{"$nulls":3},"b",{"$nulls":3},"ビ・シフロール錠0.5ｍｇ"]
["ビソルボン細粒　２％",{"$nulls":3},"b",null,"b",{"$nulls":5},"ビソルボン細粒　２％"]
["ビソルボン錠　４ｍｇ",null,null,"●","b",null,"b",{"$nulls":5},"ビソルボン錠　４ｍｇ"]
["ビタメジン配合カプセルＢ２５",null,null,"●","b",null,"b",{"$nulls":5},"ビタメジン配合カプセルＢ２５"]
["ヒダントール錠２５ｍｇ",null,null,"▲","b",null,"b",{"$nulls":5},"ヒダントール錠２５ｍｇ"]
["ピドキサール錠　１０ｍｇ","中外",null,"●","g",null,"g",{"$nulls":5},"ピドキサール錠　１０ｍｇ"]
["ビビアント錠２０ｍｇ　","ファイザー",null,"▲","b",{"$nulls":3},"b",{"$nulls":3},"ビビアント錠２０ｍｇ　"]
["ビブラマイシン錠　１００ｍｇ",null,null,"▲","c",null,"c",{"$nulls":5},"ビブラマイシン錠　１００ｍｇ"]
["ピラマイド",{"$nulls":3},"b",null,"b",{"$nulls":5},"ピラマイド"]
["ビリアード錠３００ｍｇ","日本たばこ",null,"×","b",null,"b",{"$nulls":3},"HIV",null,"ビリアード錠３００ｍｇ"]
["ビルトリシド錠600ｍｇ","バイエル",null,"×","b",null,"b",{"$nulls":5},"ビルトリシド錠600ｍｇ"]
["ヒルナミン細粒１０％",{"$nulls":3},"b",null,"b",{"$nulls":4},"ゆっくり注入してください。","ヒルナミン細粒１０％"]
["ピレスパ錠２００ｍｇ","塩野義",null,"▲","b",null,"b",{"$nulls":5},"ピレスパ錠２００ｍｇ"]
["ファスティック錠９０ｍｇ",null,null,"×","b",null,"b",{"$nulls":5},"ファスティック錠９０ｍｇ"]
["ファモチジンＤ錠20ｍｇ「サワイ」",null,null,"●","b",null,"b",{"$nulls":5},"ファモチジンＤ錠20ｍｇ「サワイ」"]
["ファロム錠200ｍｇ",null,null,"▲","g",null,"g",{"$nulls":5},"ファロム錠200ｍｇ"]
["ブイフェンド錠５０ｍｇ","ファイザー",null,"×","b",null,"b",{"$nulls":5},"ブイフェンド錠５０ｍｇ"]
["フェアストン錠　４０ｍｇ",null,null,"×","b",null,"b",{"$nulls":3},"抗がん剤",null,"フェアストン錠　４０ｍｇ"]
["フェキソフェナジン塩酸塩錠６０ｍｇ「SANIK」","日医工サノフィー",null,"●","g",null,null,"g",{"$nulls":4},"フェキソフェナジン塩酸塩錠６０ｍｇ「SANIK」"]
["フェネルミン錠50mg",null,null,"●","b",null,"b",{"$nulls":5},"フェネルミン錠50mg"]
["フェノバール散　１０％","第一三共","藤永",null,"b",null,null,"b",{"$nulls":4},"フェノバール散　１０％"]
["フェノバール錠３０ｍｇ","藤永",null,"▲","b",null,"b",{"$nulls":5},"フェノバール錠３０ｍｇ"]
["フェブリク錠２０ｍｇ","帝人ファーマ",null,"●","b",null,"b",{"$nulls":5},"フェブリク錠２０ｍｇ"]
["フェマーラ錠　２．５ｍｇ","ノバルティス",null,"×","b",null,"b",{"$nulls":3},"抗がん剤",null,"フェマーラ錠　２．５ｍｇ"]
["フェロ・グラデュメット錠１０５ｍｇ　",null,null,"●","g",null,"g",{"$nulls":5},"フェロ・グラデュメット錠１０５ｍｇ　"]
["フェロベリン錠","MSD",null,"▲","b",null,"b",{"$nulls":5},"フェロベリン錠"]
["フオイパン錠　１００ｍｇ",null,null,"●","b",null,"b",{"$nulls":5},"フオイパン錠　１００ｍｇ"]
["フォサマック錠３５ｍｇ","MSD",null,"×","b",null,null,"b",null,null,"特殊",null,"フォサマック錠３５ｍｇ"]
["フォスブロック錠２５０ｍｇ","協和発酵キリン",null,"●","g",null,null,"g",null,null,"吸湿性で膨脹",null,"フォスブロック錠２５０ｍｇ"]
["フォリアミン錠　５ｍｇ",null,null,"▲","b",null,"b",{"$nulls":5},"フォリアミン錠　５ｍｇ"]
["ブスコパン錠　１０ｍｇ",null,null,"▲","b",null,"b",{"$nulls":5},"ブスコパン錠　１０ｍｇ"]
["プラザキサカプセル　１１０ｍｇ","ベーリンガー",null,"×","g",null,null,"g",null,null,"脱カプセルでAUC上昇",null,"プラザキサカプセル　１１０ｍｇ"]
["プラザキサカプセル　７５ｍｇ","ベーリンガー",null,"×","g",null,null,"g",null,null,"脱カプセルでAUC上昇",null,"プラザキサカプセル　７５ｍｇ"]
["フラジール内服錠　２５０ｍｇ",null,null,"●","g",null,"g",{"$nulls":5},"フラジール内服錠　２５０ｍｇ"]
["ブラダロン錠２００ｍｇ",null,null,"▲","b",null,"b",{"$nulls":5},"ブラダロン錠２００ｍｇ"]
["プラノバール",null,null,"▲","b",null,"b",{"$nulls":5},"プラノバール"]
["プラビックス錠２５ｍｇ","サノフィ",null,"▲","c",null,"c",{"$nulls":5},"プラビックス錠２５ｍｇ"]
["プラビックス錠７５ｍｇ","サノフィ",null,"●","c",null,"c",{"$nulls":5},"プラビックス錠７５ｍｇ"]
["プランルカスト錠１１２．５ｍｇ　「ＥＫ」","小林化工",null,"●","b",null,null,"b",null,null,"多めの水でフラッシュ",null,"プランルカスト錠１１２．５ｍｇ　「ＥＫ」"]
["プリジスタナイーブ錠800ｍｇ","ヤンセン",null,"×","b",{"$nulls":3},"b",null,"HIV",null,"プリジスタナイーブ錠800ｍｇ"]
["フリバスＯＤ錠２５ｍｇ　",null,null,"●","b",null,"b",{"$nulls":5},"フリバスＯＤ錠２５ｍｇ　"]
["プリモボラン錠５ｍｇ",null,null,"▲","b",null,"b",{"$nulls":5},"プリモボラン錠５ｍｇ"]
["プリンペラン錠　５ｍｇ",null,null,"●","b",null,"b",{"$nulls":5},"プリンペラン錠　５ｍｇ"]
["フルイトラン錠２ｍｇ",null,null,"●","b",null,"b",{"$nulls":5},"フルイトラン錠２ｍｇ"]
["フルコナゾールカプセル１００ｍｇ「サワイ」","沢井",null,"●","b",null,"b",{"$nulls":5},"フルコナゾールカプセル１００ｍｇ「サワイ」"]
["フルダラ錠１０ｍｇ","サノフィ",null,"×","b",null,"b",{"$nulls":3},"抗がん剤（フルダラ静注あり）",null,"フルダラ錠１０ｍｇ"]
["フルバスタチン錠30mg「サワイ」","沢井",null,"●","b",null,"b",{"$nulls":5},"フルバスタチン錠30mg「サワイ」"]
["プレタールＯＤ錠　１００ｍｇ","大塚",null,"●","b",null,"b",{"$nulls":5},"プレタールＯＤ錠　１００ｍｇ"]
["ブレディニン錠　５０ｍｇ",null,null,"●","b",null,"b",{"$nulls":5},"ブレディニン錠　５０ｍｇ"]
["プレドニゾロン散「タケダ」　１％",{"$nulls":3},"b",null,"b",{"$nulls":5},"プレドニゾロン散「タケダ」　１％"]
["プレドニゾロン錠１ｍｇ（旭化成）",null,null,"●","b",null,"b",{"$nulls":5},"プレドニゾロン錠１ｍｇ（旭化成）"]
["プレドニン錠５ｍｇ",null,null,"●","b",null,"b",{"$nulls":5},"プレドニン錠５ｍｇ"]
["プレマリン錠０．６２５ｍｇ",null,null,"▲","g",null,"g",{"$nulls":5},"プレマリン錠０．６２５ｍｇ"]
["プレミネント配合錠ＬＤ","MSD",null,"●",{"$f":"IF(F451&G451&H451&H451&I451&J451=\"\",\"\",IF(F451&G451&H451&I451=\"\",J451,IF(F451&G451&H451=\"\",I451,(IF(F451&G451=\"\",H451,IF(F451=\"\",G451,F451))))))","v":"c"},{"$nulls":3},"c",{"$nulls":3},"プレミネント配合錠ＬＤ"]
["プログラフカプセル０．５ｍｇ","アステラス",null,"▲","b",{"$nulls":3},"b",{"$nulls":3},"プログラフカプセル０．５ｍｇ"]
["プログラフカプセル１ｍｇ",null,null,"▲","b",null,"b",{"$nulls":5},"プログラフカプセル１ｍｇ"]
["プロサイリン錠２０",null,null,"●","b",null,"b",{"$nulls":5},"プロサイリン錠２０"]
["プロスタ－ル錠２５　２５ｍｇ",null,null,"▲","b",null,"b",{"$nulls":5},"プロスタ－ル錠２５　２５ｍｇ"]
["プロセキソール錠　０．５ｍｇ","あすか",null,"×","g",null,null,"g",null,null,"抗がん剤/10分経過後も変化なし",null,"プロセキソール錠　０．５ｍｇ"]
["プロパジール錠　５０ｍｇ","中外",null,"▲","g",null,null,"g",null,null,"55℃20mL20分放置で懸濁可",null,"プロパジール錠　５０ｍｇ"]
["ブロバリン","日本新薬",null,null,"g",{"$nulls":3},"g",null,"シリンジ内に残る",null,"ブロバリン"]
["フロベン錠　４０ｍｇ",null,null,"▲","b",null,"b",{"$nulls":5},"フロベン錠　４０ｍｇ"]
["プロマックＤ錠７５",null,null,"×","b",null,"b",{"$nulls":5},"プロマックＤ錠７５"]
["フロモックス小児用細粒１００ｍｇ",{"$nulls":3},"b",null,"b",{"$nulls":5},"フロモックス小児用細粒１００ｍｇ"]
["フロリネフ錠　０．１ｍｇ",null,null,"●","b",null,"b",{"$nulls":5},"フロリネフ錠　０．１ｍｇ"]
["ベイスンＯＤ錠０．３",null,null,"●","b",null,"b",{"$nulls":5},"ベイスンＯＤ錠０．３"]
["ベゲタミンーＡ配合錠",null,null,"▲","g",null,"g",{"$nulls":5},"ベゲタミンーＡ配合錠"]
["ベゲタミンーＢ配合錠",null,null,"▲","g",null,"g",{"$nulls":5},"ベゲタミンーＢ配合錠"]
["ベサコリン散　５％",{"$nulls":3},"b",null,"b",{"$nulls":3},"水で溶解（温湯は不可）",null,"ベサコリン散　５％"]
["ベザトールＳＲ錠２００ｍｇ",null,null,"●","g",null,"g",{"$nulls":5},"ベザトールＳＲ錠２００ｍｇ"]
["ベサノイドカプセル　１０ｍｇ",null,null,"×","b",null,"b",{"$nulls":3},"抗がん剤",null,"ベサノイドカプセル　１０ｍｇ"]
["ベシケアＯＤ錠２．５ｍｇ","アステラス",null,"▲","g",null,null,"g",null,null,"有効成分をコーティングしてるものが沈殿しシリンジ内に残留粒子あり",null,"ベシケアＯＤ錠２．５ｍｇ"]
["ベシケアＯＤ錠５ｍｇ","アステラス",null,"●","g",null,null,"g",null,null,"有効成分をコーティングしてるものが沈殿しシリンジ内に残留粒子あり",null,"ベシケアＯＤ錠５ｍｇ"]
["ベタナミン錠１０ｍｇ","三和化学",null,"▲","b",null,null,"b",{"$nulls":4},"ベタナミン錠１０ｍｇ"]
["ベタニス錠５０ｍｇ","アステラス",null,"▲","g",null,null,"g",null,null,"徐放剤",null,"ベタニス錠５０ｍｇ"]
["ベプシドＳ２５　２５ｍｇ","ブリストルマイヤーズ",null,"×","g",null,null,"g",null,null,"抗がん剤（カプセルがシリンジに付着）",null,"ベプシドＳ２５　２５ｍｇ"]
["ヘプセラ錠１０","グラクソ",null,"×","b",null,"b","b",{"$nulls":4},"ヘプセラ錠１０"]
["ベプリコ－ル錠５０ｍｇ",null,null,"▲","b",null,"b",{"$nulls":5},"ベプリコ－ル錠５０ｍｇ"]
["ベラサスＬＡ錠60μｇ","科研",null,"▲","g",null,null,"g",null,null,"薬剤全体が徐放",null,"ベラサスＬＡ錠60μｇ"]
["ペラゾリン細粒　４００ｍｇ　０．５ｇ",{"$nulls":3},"b",null,"b",{"$nulls":5},"ペラゾリン細粒　４００ｍｇ　０．５ｇ"]
["ベリチーム配合顆粒　１ｇ",{"$nulls":3},"g",null,"g",{"$nulls":5},"ベリチーム配合顆粒　１ｇ"]
["ペリンドプリル錠４ｍｇ「日医工」","日医工",null,"●","b",null,"b",{"$nulls":5},"ペリンドプリル錠４ｍｇ「日医工」"]
["ペルサンチンＬカプセル　１５０ｍｇ",null,null,"×","e",null,"e",{"$nulls":3},"吸湿性",null,"ペルサンチンＬカプセル　１５０ｍｇ"]
["ペルサンチン錠２５ｍｇ　",null,null,"▲","b",null,"b",{"$nulls":5},"ペルサンチン錠２５ｍｇ　"]
["ベルソムラ錠15ｍｇ","MSD",null,"×","g",{"$nulls":3},"g",{"$nulls":3},"ベルソムラ錠15ｍｇ"]
["ベルソムラ錠20ｍｇ","MSD",null,"×","g",{"$nulls":3},"g",{"$nulls":3},"ベルソムラ錠20ｍｇ"]
["ヘルベッサ－Ｒカプセル１００ｍｇ　",null,null,"●","g",null,"g",{"$nulls":5},"ヘルベッサ－Ｒカプセル１００ｍｇ　"]
["ペルマックス錠２５０μｇ",null,null,"×","b",null,"b",{"$nulls":5},"ペルマックス錠２５０μｇ"]
["ベンザリン錠　５ｍｇ",null,null,"●","b",null,"b",{"$nulls":5},"ベンザリン錠　５ｍｇ"]
["ペンタサ錠　５００ｍｇ",null,null,"▲","g",null,"g",{"$nulls":5},"ペンタサ錠　５００ｍｇ"]
["ホーネル錠　０．３μｇ",null,null,"▲","b",null,"b",{"$nulls":5},"ホーネル錠　０．３μｇ"]
["ホスミシン錠５００ｍｇ",null,null,"▲","b",null,"b",{"$nulls":5},"ホスミシン錠５００ｍｇ"]
["ボルタレンＳＲカプセル　３７．５ｍｇ",null,null,"●","e",null,"e",{"$nulls":5},"ボルタレンＳＲカプセル　３７．５ｍｇ"]
["ボルタレン錠　２５ｍｇ",null,null,"●","c",null,"c",{"$nulls":5},"ボルタレン錠　２５ｍｇ"]
["ポルトラック原末　６ｇ",{"$nulls":3},"b",null,"b",{"$nulls":5},"ポルトラック原末　６ｇ"]
["ボンゾ－ル錠　２００ｍｇ",null,null,"▲","b",null,"b",{"$nulls":5},"ボンゾ－ル錠　２００ｍｇ"]
["マイスタン錠５ｍｇ",null,null,"▲","b",null,"b",{"$nulls":5},"マイスタン錠５ｍｇ"]
["マイテラ－ゼ　１０ｍｇ",null,null,"▲","b",null,"b",{"$nulls":5},"マイテラ－ゼ　１０ｍｇ"]
["マグラックス錠２５０ｍｇ　",null,null,"×","b",null,"b",{"$nulls":5},"マグラックス錠２５０ｍｇ　"]
["マグラックス錠３３０ｍｇ　",null,null,"×","b",null,"b",{"$nulls":5},"マグラックス錠３３０ｍｇ　"]
["マドパー配合錠",null,null,"●","e",null,"e",{"$nulls":3},"ドパミン製剤のため酸化マグネシウムと同時懸濁しない",null,"マドパー配合錠"]
["マブリン散　１％",{"$nulls":3},"b",null,"b",{"$nulls":5},"マブリン散　１％"]
["ミオナール錠５０ｍｇ　",null,null,"●","c",null,"c",{"$nulls":5},"ミオナール錠５０ｍｇ　"]
["ミカルディス錠４０ｍｇ","ベーリンガー",null,"●","c",null,null,"c",{"$nulls":4},"ミカルディス錠４０ｍｇ"]
["ミコブティンカプセル１５０ｍｇ","ファイザー",null,"▲","b",{"$nulls":3},"b",null,"カプセルの溶け残りがあれば取り除く",null,"ミコブティンカプセル１５０ｍｇ"]
["ミコンビ配合錠ＡＰ","ベーリンガー",null,"▲","g",{"$nulls":3},"g",{"$nulls":3},"ミコンビ配合錠ＡＰ"]
["ミニリンメルトＯＤ錠120μｇ","フェリングファーマ",null,"×","g","g",{"$nulls":6},"ミニリンメルトＯＤ錠120μｇ"]
["ミニリンメルトＯＤ錠60μｇ","フェリングファーマ",null,"×","g","g",{"$nulls":6},"ミニリンメルトＯＤ錠60μｇ"]
["ミノマイシン顆粒　２０ｍｇ",{"$nulls":3},"b",null,"b",{"$nulls":5},"ミノマイシン顆粒　２０ｍｇ"]
["ミヤＢＭ細粒　５００ｇ","ミヤリサン",null,null,"b",null,null,"b",null,null,"賦形剤の沈降炭酸カルシウムが溶け残る可能性あり→上清だけ注入を",null,"ミヤＢＭ細粒　５００ｇ"]
["ミヤＢＭ錠","ミヤリサン",null,"●","b",null,null,"b",null,null,"細粒のデータなし/賦形剤の沈降炭酸カルシウムが溶け残る可能性あり→上清だけ注入を",null,"ミヤＢＭ錠"]
["ミラペックスＬＡ錠０．３７５ｍｇ","ベーリンガー",null,"×","g",null,null,"g",null,"徐放",null,null,"ミラペックスＬＡ錠０．３７５ｍｇ"]
["ミラペックスＬＡ錠１．５ｍｇ","ベーリンガー",null,"×","g",null,null,"g",null,"徐放",null,null,"ミラペックスＬＡ錠１．５ｍｇ"]
["ムコスタ顆粒２０％　０．５ｇ",{"$nulls":3},"b",null,"b",{"$nulls":5},"ムコスタ顆粒２０％　０．５ｇ"]
["ムコダインＤＳ　５０％　１００Ｇ","杏林",null,null,"b",null,null,"b",{"$nulls":4},"ムコダインＤＳ　５０％　１００Ｇ"]
["メイアクトＭＳ小児用細粒　１００ｍｇ",{"$nulls":3},"b",null,"b",{"$nulls":5},"メイアクトＭＳ小児用細粒　１００ｍｇ"]
["メイラックス錠１ｍｇ",null,null,"●","b",null,"b",{"$nulls":5},"メイラックス錠１ｍｇ"]
["メインテート錠０．６２５ｍｇ","田辺三菱",null,"●",{"$f":"IF(F515&G515&H515&H515&I515&J515=\"\",\"\",IF(F515&G515&H515&I515=\"\",J515,IF(F515&G515&H515=\"\",I515,(IF(F515&G515=\"\",H515,IF(F515=\"\",G515,F515))))))","v":"c"},null,null,"c",{"$nulls":4},"メインテート錠０．６２５ｍｇ"]
["メインテート錠２．５ｍｇ　",null,null,"●","c",null,"c",{"$nulls":5},"メインテート錠２．５ｍｇ　"]
["メキシチールカプセル５０ｍｇ　",null,null,"●","b",null,"b",{"$nulls":5},"メキシチールカプセル５０ｍｇ　"]
["メジコン散　１０％",{"$nulls":3},"b",null,"b",{"$nulls":5},"メジコン散　１０％"]
["メジコン錠　１５ｍｇ",null,null,"●","b",null,"b",{"$nulls":5},"メジコン錠　１５ｍｇ"]
["メスチノン錠　６０ｍｇ",null,null,"▲","b",null,"b",{"$nulls":5},"メスチノン錠　６０ｍｇ"]
["メソトレキセート錠２．５ｍｇ",null,null,"×","g",null,"g",{"$nulls":3},"抗がん剤",null,"メソトレキセート錠２．５ｍｇ"]
["メタルカプタ－ゼカプセル２００ｍｇ",null,null,"▲","b",null,"b",{"$nulls":5},"メタルカプタ－ゼカプセル２００ｍｇ"]
["メチコバール錠５００μｇ　",null,null,"●","b",null,"b",{"$nulls":5},"メチコバール錠５００μｇ　"]
["メチルエルゴメトリン錠　０．１２５ｍｇ「あすか」　","あすか",null,"▲","b",null,"b",{"$nulls":5},"メチルエルゴメトリン錠　０．１２５ｍｇ「あすか」　"]
["メトグルコ錠　２５０ｍｇ","大日本住友",null,"●","b",{"$nulls":3},"b",{"$nulls":3},"メトグルコ錠　２５０ｍｇ"]
["メトリジン錠２ｍｇ",null,null,"●","b",null,"b",{"$nulls":5},"メトリジン錠２ｍｇ"]
["メトレート錠２ｍｇ","参天",null,"×","b",null,"b",{"$nulls":3},"抗がん剤",null,"メトレート錠２ｍｇ"]
["メドロール錠　４ｍｇ",null,null,"▲","b",null,"b",{"$nulls":5},"メドロール錠　４ｍｇ"]
["メネシット配合錠１００",null,null,"●","e",null,"e",{"$nulls":5},"メネシット配合錠１００"]
["メプチン錠５０μｇ",null,null,"▲","b",null,"b",{"$nulls":5},"メプチン錠５０μｇ"]
["メマリーＯＤ錠20ｍｇ","第一三共",null,"▲","b",null,null,"b",null,null,"55℃以上は凝集物質が生成",null,"メマリーＯＤ錠20ｍｇ"]
["メリスロン錠　６ｍｇ",null,null,"●","b",null,"b",{"$nulls":5},"メリスロン錠　６ｍｇ"]
["メルカゾール錠　５ｍｇ",null,null,"●","g",null,"g",{"$nulls":5},"メルカゾール錠　５ｍｇ"]
["メンドン７．５ｍｇ",null,null,"▲","b",null,"b",{"$nulls":5},"メンドン７．５ｍｇ"]
["モサプリドクエン酸塩錠5mg「日医工」",null,null,"●","b",null,"b",{"$nulls":5},"モサプリドクエン酸塩錠5mg「日医工」"]
["モ－ビック錠１０ｍｇ","ベーリンガー",null,"▲","b",{"$nulls":3},"b",{"$nulls":3},"モ－ビック錠１０ｍｇ"]
["薬用炭",{"$nulls":3},"g","g",{"$nulls":6},"薬用炭"]
["ユーゼル錠２５ｍｇ","大鵬",null,"▲","b",null,"b",{"$nulls":5},"ユーゼル錠２５ｍｇ"]
["ユーロジン１ｍｇ錠",null,null,"●","b",null,"b",{"$nulls":5},"ユーロジン１ｍｇ錠"]
["ユ－エフティカプセル１００ｍｇ",null,null,"×","b",null,"b",{"$nulls":3},"抗がん剤",null,"ユ－エフティカプセル１００ｍｇ"]
["ユナシン細粒小児用　１００ｍｇ",{"$nulls":3},"g",null,"g",{"$nulls":5},"ユナシン細粒小児用　１００ｍｇ"]
["ユナシン錠　３７５ｍｇ",null,null,"▲","b",null,"b",{"$nulls":5},"ユナシン錠　３７５ｍｇ"]
["ユニフィルＬＡ錠２００ｍｇ",null,null,"▲","g",null,"g",{"$nulls":5},"ユニフィルＬＡ錠２００ｍｇ"]
["ユベラＮカプセル　１００ｍｇ",null,null,"●","b",null,"b",{"$nulls":5},"ユベラＮカプセル　１００ｍｇ"]
["ユリーフ錠４ｍｇ",null,null,"●","b",null,"b",{"$nulls":5},"ユリーフ錠４ｍｇ"]
["ユリノーム錠５０ｍｇ　",null,null,"●","b",null,"b",{"$nulls":5},"ユリノーム錠５０ｍｇ　"]
["ヨウ化カリウム「日医工」",{"$nulls":3},"b",null,"b",{"$nulls":5},"ヨウ化カリウム「日医工」"]
["ラシックス２０ｍｇ錠",null,null,"●","b",null,"b",{"$nulls":5},"ラシックス２０ｍｇ錠"]
["ラジレス錠１５０ｍｇ","ノバルティス",null,"×","g",{"$nulls":3},"g",{"$nulls":3},"ラジレス錠１５０ｍｇ"]
["ラックビ－Ｒ（シール）１ｇ",{"$nulls":3},"b",null,"b",{"$nulls":3},"温湯による生菌数低下の可能性あり",null,"ラックビ－Ｒ（シール）１ｇ"]
["ラックビー微粒Ｎ　１％　1GX1008包","興和創薬",null,null,"g",null,null,"g",{"$nulls":4},"ラックビー微粒Ｎ　１％　1GX1008包"]
["ラニラピッド錠　０．１ｍｇ",null,null,"●","b",null,"b",{"$nulls":5},"ラニラピッド錠　０．１ｍｇ"]
["ラフチジン錠10mg「日医工」","日医工",null,"●","b",null,"b",{"$nulls":5},"ラフチジン錠10mg「日医工」"]
["ラベキュアパック４００","エーザイ",null,"×","g","g",{"$nulls":4},"特殊",null,"ラベキュアパック４００"]
["ラベプラゾールNa塩錠10mg「明治」","Ｍｅｉｊｉ",null,"●","g",null,"g",{"$nulls":3},"腸瘻なら可",null,"ラベプラゾールNa塩錠10mg「明治」"]
["ラミクタール錠１００ｍｇ　","グラクソ",null,"▲","b",null,"b","b",{"$nulls":4},"ラミクタール錠１００ｍｇ　"]
["ラミクタール錠２５ｍｇ　","グラクソ",null,"▲","b",null,"b","b",{"$nulls":4},"ラミクタール錠２５ｍｇ　"]
["ラミクタール錠小児用２ｍｇ　","グラクソ",null,"▲","b",null,"b","b",{"$nulls":4},"ラミクタール錠小児用２ｍｇ　"]
["ラミクタール錠小児用５ｍｇ　","グラクソ",null,"▲","b",null,"b","b",{"$nulls":4},"ラミクタール錠小児用５ｍｇ　"]
["ランソプラゾールOD錠15mg「トーワ」",null,null,"●","e",null,"e",{"$nulls":5},"ランソプラゾールOD錠15mg「トーワ」"]
["リーゼ錠５ｍｇ",null,null,"●","b",null,"b",{"$nulls":5},"リーゼ錠５ｍｇ"]
["リーマス錠２００ｍｇ",null,null,"▲","c",null,"c",{"$nulls":5},"リーマス錠２００ｍｇ"]
["リオレサール錠５ｍｇ",null,null,"●","b",null,"b",{"$nulls":5},"リオレサール錠５ｍｇ"]
["リクシアナ錠60ｍｇ","第一三共",null,"●","b",null,null,"b",{"$nulls":4},"リクシアナ錠60ｍｇ"]
["リザベンカプセル１００ｍｇ",null,null,"▲","b",null,"b",{"$nulls":5},"リザベンカプセル１００ｍｇ"]
["リスパダ－ル錠１ｍｇ",null,null,"●","b",null,"b",{"$nulls":5},"リスパダ－ル錠１ｍｇ"]
["リスミー錠１ｍｇ",null,null,"●","b",null,"b",{"$nulls":5},"リスミー錠１ｍｇ"]
["リズミック錠１０ｍｇ",null,null,"●","b",null,"b",{"$nulls":5},"リズミック錠１０ｍｇ"]
["リ－バクト配合顆粒　４．１５ｇ",{"$nulls":3},"g",null,"g",{"$nulls":5},"リ－バクト配合顆粒　４．１５ｇ"]
["リパクレオンカプセル１５０ｍｇ","アボット",null,"●","g",null,null,"g",null,null,"胃内で失活",null,"リパクレオンカプセル１５０ｍｇ"]
["リバロ錠２ｍｇ","興和",null,"●","b",null,null,"b",null,null,"光に不安定なので懸濁後30分以内に注入",null,"リバロ錠２ｍｇ"]
["リファジンカプセル　１５０ｍｇ","第一三共",null,"●","b",null,null,"b",null,null,"カプセルの一部がシリンジ付着するが通過には問題なし",null,"リファジンカプセル　１５０ｍｇ"]
["リフレックス錠１５ｍｇ","Ｍｅｉｊｉ",null,"▲","b",null,null,"b",{"$nulls":4},"リフレックス錠１５ｍｇ"]
["リボトリール細粒　０．１％",{"$nulls":3},"b",null,"b",{"$nulls":5},"リボトリール細粒　０．１％"]
["リボトリール錠０．５ｍｇ",null,null,"●","b",null,"b",{"$nulls":5},"リボトリール錠０．５ｍｇ"]
["リマチル　１００ｍｇ",null,null,"▲","g",null,"g",{"$nulls":5},"リマチル　１００ｍｇ"]
["リマプロストアルファデクス錠５μｇ「F」","富士製薬",null,"×","b",null,"b",{"$nulls":5},"リマプロストアルファデクス錠５μｇ「F」"]
["リリカカプセル２５ｍｇ　","ファイザー",null,"●","b",null,null,"b",null,null,"150mgのデータ参照",null,"リリカカプセル２５ｍｇ　"]
["リリカカプセル７５ｍｇ","ファイザー",null,"●",{"$f":"IF(F579&G579&H579&H579&I579&J579=\"\",\"\",IF(F579&G579&H579&I579=\"\",J579,IF(F579&G579&H579=\"\",I579,(IF(F579&G579=\"\",H579,IF(F579=\"\",G579,F579))))))","v":"b"},null,null,"b",null,null,"150mgのデータ参照",null,"リリカカプセル７５ｍｇ"]
["リルテック錠　５０ｍｇ",null,null,"▲","c",null,"c",{"$nulls":5},"リルテック錠　５０ｍｇ"]
["リンデロン散　０．１％",{"$nulls":3},"b",null,"b",{"$nulls":5},"リンデロン散　０．１％"]
["リンデロン錠　０．５ｍｇ",null,null,"●","b",null,"b",{"$nulls":5},"リンデロン錠　０．５ｍｇ"]
["ルーラン錠４ｍｇ",null,null,"▲","b",null,"b",{"$nulls":5},"ルーラン錠４ｍｇ"]
["ルジオミール錠１０ｍｇ",null,null,"▲","b",null,"b",{"$nulls":5},"ルジオミール錠１０ｍｇ"]
["ルセフィ錠2.5ｍｇ","大正富山",null,"▲","b",null,null,"b",{"$nulls":4},"ルセフィ錠2.5ｍｇ"]
["ルネスタ錠1ｍｇ","エーザイ",null,"●","g",null,"g",{"$nulls":5},"ルネスタ錠1ｍｇ"]
["ルプラック錠４ｍｇ",null,null,"●","b",null,"b",{"$nulls":5},"ルプラック錠４ｍｇ"]
["ルボックス錠　２５ｍｇ",null,null,"●","c",null,"c",{"$nulls":5},"ルボックス錠　２５ｍｇ"]
["ルリッド錠１５０",null,null,"▲","b",null,"b",{"$nulls":5},"ルリッド錠１５０"]
["レイアタッツカプセル１５０ｍｇ","ブリストルマイヤーズ",null,"×","b",null,"b",{"$nulls":3},"HIV",null,"レイアタッツカプセル１５０ｍｇ"]
["レキップＣＲ錠２ｍｇ","グラクソ",null,"▲","b",null,null,"b",{"$nulls":4},"レキップＣＲ錠２ｍｇ"]
["レキップ錠０．２５ｍｇ","グラクソ",null,"▲","b",null,"b","b",{"$nulls":4},"レキップ錠０．２５ｍｇ"]
["レキップ錠１ｍｇ","グラクソ",null,"▲","b",null,"b","b",{"$nulls":4},"レキップ錠１ｍｇ"]
["レキップ錠ＣＲ8ｍｇ","グラクソ",null,"▲","b",null,null,"b",{"$nulls":4},"レキップ錠ＣＲ8ｍｇ"]
["レクサプロ錠１０ｍｇ","田辺三菱","持田製薬","▲","b",null,null,"b",{"$nulls":4},"レクサプロ錠１０ｍｇ"]
["レクシヴァ錠７００","ヴィーブ",null,"×","c",null,"c",{"$nulls":3},"HIV",null,"レクシヴァ錠７００"]
["レクチゾール錠２５ｍｇ",null,null,"▲","b",null,"b",{"$nulls":5},"レクチゾール錠２５ｍｇ"]
["レグパラ錠25ｍｇ","協和発酵キリン",null,"●","b",null,null,"b",{"$nulls":4},"レグパラ錠25ｍｇ"]
["レスタミンコーワ錠　１０ｍｇ",null,null,"▲","c",null,"c",{"$nulls":5},"レスタミンコーワ錠　１０ｍｇ"]
["レダマイシンカプセル　１５０ｍｇ",null,null,"▲","b",null,"b",{"$nulls":5},"レダマイシンカプセル　１５０ｍｇ"]
["レトロビルカプセル　１００ｍｇ",null,null,"×","b",null,"b",{"$nulls":3},"HIV",null,"レトロビルカプセル　１００ｍｇ"]
["レナデックス錠　４ｍｇ","セルジーン",null,"▲","b",{"$nulls":3},"b",{"$nulls":3},"レナデックス錠　４ｍｇ"]
["レバチオ錠２０ｍｇ","ファイザー",null,"▲","b",null,null,"b",null,null,"120mlのフラッシュ必要",null,"レバチオ錠２０ｍｇ"]
["レバミピド錠100mg「EMEC」","ＥＭＥＣ","大原","●","b",null,"b","b",{"$nulls":4},"レバミピド錠100mg「EMEC」"]
["レフト－ゼ錠（５０ｍｇ）",null,null,"▲","c",null,"c",{"$nulls":5},"レフト－ゼ錠（５０ｍｇ）"]
["レブラミドカプセル　５ｍｇ","セルジーン",null,"×","b",null,null,"b",null,null,"抗がん剤",null,"レブラミドカプセル　５ｍｇ"]
["レベトールカプセル２００ｍｇ","MSD",null,"▲","b",{"$nulls":3},"b",null,"カプセルがゼラチンのため溶解は可だが催奇形性・原薬の刺激性あり",null,"レベトールカプセル２００ｍｇ"]
["レボフロキサシン錠２５０ｍｇ「DSEP]","第一三共エスファ",null,"▲","c",null,null,"c",{"$nulls":4},"レボフロキサシン錠２５０ｍｇ「DSEP]"]
["レボフロキサシン錠５００ｍｇ「DSEP]","第一三共エスファ",null,"●","c",null,null,"c",{"$nulls":4},"レボフロキサシン錠５００ｍｇ「DSEP]"]
["レボレード錠　１２．５ｍｇ","グラクソ",null,"×","g",null,null,"g",null,null,"懸濁するとAUC22％上昇",null,"レボレード錠　１２．５ｍｇ"]
["レミニールＯＤ錠　４ｍｇ","武田","ヤンセン","▲","b",{"$nulls":3},"b",{"$nulls":3},"レミニールＯＤ錠　４ｍｇ"]
["ロイケリン散　１０％",{"$nulls":3},"b",null,"b",{"$nulls":5},"ロイケリン散　１０％"]
["ロイコボリン錠５ｍｇ","ファイザー",null,"▲","b",null,"b",{"$nulls":5},"ロイコボリン錠５ｍｇ"]
["ロイコン錠１０ｍｇ",null,null,"▲","b",null,"b",{"$nulls":5},"ロイコン錠１０ｍｇ"]
["ロカルトロ－ルカプセル０．５μｇ",null,null,"▲","b",null,"b",{"$nulls":5},"ロカルトロ－ルカプセル０．５μｇ"]
["ロキソプロフェン錠６０ｍｇ　「ＥＭＥＣ」",null,null,"●","c",null,"c",{"$nulls":5},"ロキソプロフェン錠６０ｍｇ　「ＥＭＥＣ」"]
["ロゼレム錠８ｍｇ","武田",null,"●","c",null,null,"c",{"$nulls":4},"ロゼレム錠８ｍｇ"]
["ロペミンカプセル　１ｍｇ　","ヤンセン",null,"●","b",null,"b",{"$nulls":5},"ロペミンカプセル　１ｍｇ　"]
["ロルカム錠４ｍｇ",null,null,"▲","b",null,"b",{"$nulls":5},"ロルカム錠４ｍｇ"]
["ワーファリン錠１ｍｇ",null,null,"●","b",null,"b",{"$nulls":5},"ワーファリン錠１ｍｇ"]
["ワイパックス錠　０．５ｍｇ",null,null,"●","b",null,"b",{"$nulls":5},"ワイパックス錠　０．５ｍｇ"]
["ワカデニン腸溶錠10ｍｇ","わかもと",null,"▲","g","g",{"$nulls":4},"胃酸に弱い",null,"ワカデニン腸溶錠10ｍｇ"]
["ワソラン錠４０ｍｇ",null,null,"●","c",null,"c",{"$nulls":5},"ワソラン錠４０ｍｇ"]
["ワンアルファ錠　０．２５μｇ　",null,null,"●","b",null,"b",{"$nulls":5},"ワンアルファ錠　０．２５μｇ　"]
["ワンアルファ錠　１μｇ　",null,null,"●","b",null,"b",{"$nulls":5},"ワンアルファ錠　１μｇ　"]
["塩酸プロカルバジンカプセル　５０ｍｇ","中外",null,"×","b",null,"b",{"$nulls":3},"抗がん剤",null,"塩酸プロカルバジンカプセル　５０ｍｇ"]
["塩酸ミノサイクリンカプセル１００「日医工」","日医工",null,"●","b",null,"b",{"$nulls":3},"色が濃いのでフラッシュ必要",null,"塩酸ミノサイクリンカプセル１００「日医工」"]
["臭化カリウム　１００ｇ","山善",null,null,"b",null,null,"b",{"$nulls":4},"臭化カリウム　１００ｇ"]
["炭酸水素ナトリウム　５００ｇ「シオエ」","日本新薬","シオエ",null,"b",{"$nulls":3},"b",null,"アルカリ性になる　「シオエ」のデータはないが可と考える",null,"炭酸水素ナトリウム　５００ｇ「シオエ」"]
["調剤用パンビタン末","武田",null,null,"b",{"$nulls":3},"b",{"$nulls":3},"調剤用パンビタン末"]
["乳酸カルシウム「ヨシダ」　",{"$nulls":3},"b",null,"b",{"$nulls":5},"乳酸カルシウム「ヨシダ」　"]
["乳糖　（粒状）　５００ｇ","健栄",null,null,"b",null,null,"b",{"$nulls":4},"乳糖　（粒状）　５００ｇ"]
["硫酸ポリミキシンＢ錠100万単位","ファイザ-",null,"▲","g",null,"g",{"$nulls":5},"硫酸ポリミキシンＢ錠100万単位"]

{"sheet":"29150616コメント入力","index":6,"n_rows":633,"n_cols":13,"rows_kept":633,"hidden":true}
["2015.2月末の当院採用薬品\na.無し b.懸濁可 c.破壊 d.粉砕　e.条件付 f.懸濁不可 g.懸濁不適",{"$nulls":5},"a.無し b.懸濁可 c.破壊 d.粉砕　e.条件付 f.懸濁不可 g.懸濁不適"]
["薬品名","販売","製造","一包化最終決定","簡易懸濁最終決定","特殊等","ハンドブック","メーカー","他院DB","実験","条件","コメント","薬品名"]
["Ｄ－ソルビトール","丸石",null,null,{"$f":"IF(F3&G3&H3&H3&I3&J3=\"\",\"\",IF(F3&G3&H3&I3=\"\",J3,IF(F3&G3&H3=\"\",I3,(IF(F3&G3=\"\",H3,IF(F3=\"\",G3,F3))))))","v":"g"},{"$nulls":3},"g",null,"14Fr.は可　液の製剤がある様子",null,"Ｄ－ソルビトール"]
["Ｌ－ケフレックス顆粒　５００ｍｇ",{"$nulls":3},"g",null,"g",{"$nulls":5},"Ｌ－ケフレックス顆粒　５００ｍｇ"]
["ＰＬ配合顆粒",{"$nulls":3},"b",null,"b",{"$nulls":5},"ＰＬ配合顆粒"]
["Ｓ・Ｍ散",{"$nulls":3},"b",null,"b",{"$nulls":5},"Ｓ・Ｍ散"]
["アーチスト錠１０ｍｇ",null,null,"●","b",null,"b",{"$nulls":5},"アーチスト錠１０ｍｇ"]
["アーチスト錠２．５ｍｇ","第一三共",null,"●","b",null,null,"b",{"$nulls":4},"アーチスト錠２．５ｍｇ"]
["アーテン錠（２ｍｇ）　",null,null,"▲","b",null,"b",{"$nulls":5},"アーテン錠（２ｍｇ）　"]
["アイセントレス錠４００ｍｇ","MSD",null,"×","g",null,"g",{"$nulls":3},"HIV/破壊し長時間かければ投与可",null,"アイセントレス錠４００ｍｇ"]
["アイトロール錠２０ｍｇ",null,null,"▲","b",null,"b",{"$nulls":5},"アイトロール錠２０ｍｇ"]
["アカルディカプセル１．２５ｍｇ",null,null,"×","b",null,"b",{"$nulls":5},"アカルディカプセル１．２５ｍｇ"]
["アキネトン錠　１ｍｇ",null,null,"▲","b",null,"b",{"$nulls":5},"アキネトン錠　１ｍｇ"]
["アクトス錠１５",null,null,"▲","b",null,"b",{"$nulls":5},"アクトス錠１５"]
["アクトネル錠２．５ｍｇ","エーザイ","味のもと","▲","b",null,null,"b",null,null,"17.5mgのデータ参照",null,"アクトネル錠２．５ｍｇ"]
["アコファイド錠100ｍｇ","ゼリア",null,"▲","b",null,null,"b",{"$nulls":4},"アコファイド錠100ｍｇ"]
["アサコール錠４００ｍｇ","協和発酵キリン","ゼリア","×","g",null,null,"g",null,null,"小腸で吸収",null,"アサコール錠４００ｍｇ"]
["アザルフィジンＥＮ錠　５００ｍｇ",null,null,"▲","c",null,"c",{"$nulls":5},"アザルフィジンＥＮ錠　５００ｍｇ"]
["アシノン錠１５０ｍｇ",null,null,"▲","b",null,"b",{"$nulls":5},"アシノン錠１５０ｍｇ"]
["アジャストＡコーワ錠４０ｍｇ",null,null,"●","b",null,"b",{"$nulls":5},"アジャストＡコーワ錠４０ｍｇ"]
["アジルバ錠４０ｍｇ","武田",null,"●","b",null,null,"b",{"$nulls":4},"アジルバ錠４０ｍｇ"]
["アスパラカリウム散　５０％","田辺製薬販売",null,null,"g","g",{"$nulls":6},"アスパラカリウム散　５０％"]
["アスパラカリウム錠　３００ｍｇ",null,null,"×","g",null,"g",{"$nulls":5},"アスパラカリウム錠　３００ｍｇ"]
["アスピリン","日本新薬","シオエ",null,"b",{"$nulls":3},"b",null,"溶解しないが懸濁状態で通過",null,"アスピリン"]
["アスペノンカプセル１０ｍｇ",null,null,"▲","b",null,"b",{"$nulls":5},"アスペノンカプセル１０ｍｇ"]
["アセチルスピラマイシン錠　２００ｍｇ",null,null,"▲","b",null,"b",{"$nulls":5},"アセチルスピラマイシン錠　２００ｍｇ"]
["アセトアミノフェン「マルイシ」",{"$nulls":3},"e",null,"e",{"$nulls":5},"アセトアミノフェン「マルイシ」"]
["アタラックス－Ｐカプセル２５ｍｇ　",null,null,"●","b",null,"b",{"$nulls":4},"多めの水でフラッシュ","アタラックス－Ｐカプセル２５ｍｇ　"]
["アデホスコーワ顆粒１０％",{"$nulls":3},"g",null,"g",{"$nulls":5},"アデホスコーワ顆粒１０％"]
["アテレック錠　１０ｍｇ",null,null,"●","b",null,"b",{"$nulls":5},"アテレック錠　１０ｍｇ"]
["アドシルカ錠20ｍｇ","リリー","日本新薬","▲","b",{"$nulls":3},"b",{"$nulls":3},"アドシルカ錠20ｍｇ"]
["アドソルビン",{"$nulls":3},"b",null,"b",{"$nulls":5},"アドソルビン"]
["アドナ錠３０ｍｇ　",null,null,"×","b",null,"b",{"$nulls":5},"アドナ錠３０ｍｇ　"]
["アトルバスタチンOD錠10mg「トーワ」","東和",null,"▲","c",null,"c",{"$nulls":5},"アトルバスタチンOD錠10mg「トーワ」"]
["アナフラニール錠１０ｍｇ",null,null,"×","c",null,"c",{"$nulls":5},"アナフラニール錠１０ｍｇ"]
["アフィニトール錠　５ｍｇ","ノバルティス",null,"▲","b",null,"b",{"$nulls":3},"抗がん剤","調製者の暴露に注意","アフィニトール錠　５ｍｇ"]
["アプレゾリン錠１０ｍｇ　",null,null,"▲","c",null,"c",{"$nulls":4},"多めの水でフラッシュ","アプレゾリン錠１０ｍｇ　"]
["アベロックス錠４００ｍｇ","富士フィルム","バイエル","▲","b",null,"b",{"$nulls":5},"アベロックス錠４００ｍｇ"]
["アボルブカプセル　０．５ｍｇ","グラクソ",null,"▲","g",null,null,"g",null,null,"カプセル内脂溶性液体・口腔内刺激あり",null,"アボルブカプセル　０．５ｍｇ"]
["アマリ－ル１ｍｇ錠",null,null,"×","b",null,"b",{"$nulls":5},"アマリ－ル１ｍｇ錠"]
["アミサリン錠１２５ｍｇ",null,null,"▲","g",null,"g",{"$nulls":5},"アミサリン錠１２５ｍｇ"]
["アミティーザカプセル24μｇ","スキャンポファーマ",null,"▲","b",null,null,"b",{"$nulls":4},"アミティーザカプセル24μｇ"]
["アムノレイク錠２ｍｇ","日本新薬","東光","●","g",{"$nulls":3},"g",null,"抗がん剤","調製者の暴露に注意","アムノレイク錠２ｍｇ"]
["アムロジピンＯＤ錠5ｍｇ「ＥＭＥＣ」",null,null,"●","b",null,"b",{"$nulls":5},"アムロジピンＯＤ錠5ｍｇ「ＥＭＥＣ」"]
["アメパロモカプセル250ｍｇ","ファイザー",null,"×","g","g",{"$nulls":4},"必要時相談",null,"アメパロモカプセル250ｍｇ"]
["アモキサンカプセル２５ｍｇ",null,null,"▲","b",null,"b",{"$nulls":5},"アモキサンカプセル２５ｍｇ"]
["アモキシシリンカプセル250mg「日医工」","日医工",null,"▲","b",null,"b",{"$nulls":3},"内容物粒子が大きめで大量のため十分なフラッシュを","多めの水でフラッシュ","アモキシシリンカプセル250mg「日医工」"]
["アリセプトＤ錠３ｍｇ",null,null,"▲","b",null,"b",{"$nulls":5},"アリセプトＤ錠３ｍｇ"]
["アリセプトＤ錠５ｍｇ",null,null,"●","b",null,"b",{"$nulls":5},"アリセプトＤ錠５ｍｇ"]
["アリナミンＦ糖衣錠２５ｍｇ　",null,null,"▲","c",null,"c",{"$nulls":5},"アリナミンＦ糖衣錠２５ｍｇ　"]
["アリミデックス錠　１ｍｇ","アストラゼネカ",null,"●","b",null,"b",{"$nulls":3},"抗がん剤","調製者の暴露に注意","アリミデックス錠　１ｍｇ"]
["アルケラン錠　２ｍｇ",null,null,"●","b",null,"b",{"$nulls":3},"抗がん剤","調製者の暴露に注意","アルケラン錠　２ｍｇ"]
["アルサルミン細粒　９０％",{"$nulls":3},"b",null,"b",{"$nulls":5},"アルサルミン細粒　９０％"]
["アルダクトンＡ錠　２５ｍｇ　",null,null,"▲","b",null,"b",{"$nulls":5},"アルダクトンＡ錠　２５ｍｇ　"]
["アルドメット錠　２５０ｍｇ",null,null,"×","b",null,"b",{"$nulls":3},"ドパミン製剤のため酸化マグネシウムと同時懸濁しない","酸化マグネシウム（マグラックスなど）と同時懸濁しない/多めの水でフラッシュ","アルドメット錠　２５０ｍｇ"]
["アルファロール散　１μｇ／ｇ","中外",null,null,"b",null,null,"b",{"$nulls":4},"アルファロール散　１μｇ／ｇ"]
["アレセンサカプセル20ｍｇ","中外",null,"▲","b",null,null,"b",null,null,"抗がん剤","調製者の暴露に注意","アレセンサカプセル20ｍｇ"]
["アレセンサカプセル40ｍｇ","中外",null,"▲","b",null,null,"b",null,null,"抗がん剤","調製者の暴露に注意","アレセンサカプセル40ｍｇ"]
["アレビアチン散１０％","大日本住友",null,null,"b",{"$nulls":3},"b",{"$nulls":3},"アレビアチン散１０％"]
["アレロック顆粒０．５％","協和発酵キリン",null,null,"g",null,null,"g",{"$nulls":4},"アレロック顆粒０．５％"]
["アロチノロール塩酸塩錠１０ｍｇ「ＤＳＰ」","大日本住友",null,"×","b",null,"b",{"$nulls":5},"アロチノロール塩酸塩錠１０ｍｇ「ＤＳＰ」"]
["アロプリノール錠100ｍｇ「杏林」","杏林",null,"▲","b",null,"b",{"$nulls":5},"アロプリノール錠100ｍｇ「杏林」"]
["アロマシン錠25ｍｇ","ファイザー",null,"▲","b",null,"b",{"$nulls":3},"抗がん剤","調製者の暴露に注意","アロマシン錠25ｍｇ"]
["アンカロン錠100ｍｇ",null,null,"▲","b",null,"b",{"$nulls":4},"多めの水でフラッシュ","アンカロン錠100ｍｇ"]
["アンコチル錠500ｍｇ",null,null,"▲","b",null,"b",{"$nulls":5},"アンコチル錠500ｍｇ"]
["アンナカ「ヨシダ」",{"$nulls":3},"b",null,"b",{"$nulls":5},"アンナカ「ヨシダ」"]
["アンブロキソール塩酸塩錠15mg「サワイ」","沢井",null,"●",{"$f":"IF(F67&G67&H67&H67&I67&J67=\"\",\"\",IF(F67&G67&H67&I67=\"\",J67,IF(F67&G67&H67=\"\",I67,(IF(F67&G67=\"\",H67,IF(F67=\"\",G67,F67))))))","v":"b"},null,"b",{"$nulls":5},"アンブロキソール塩酸塩錠15mg「サワイ」"]
["アンブロキソール塩酸塩徐放OD錠45mg「サワイ」","沢井",null,"●","b",null,null,"b",{"$nulls":4},"アンブロキソール塩酸塩徐放OD錠45mg「サワイ」"]
["イーケプラ錠250ｍｇ","ＵＣＢ","大塚","●","c",null,"c",{"$nulls":5},"イーケプラ錠250ｍｇ"]
["イーケプラ錠500ｍｇ","ＵＣＢ","大塚","▲","c",null,"c",{"$nulls":5},"イーケプラ錠500ｍｇ"]
["イグザレルト錠10ｍｇ","バイエル",null,"●","b",null,"b",{"$nulls":5},"イグザレルト錠10ｍｇ"]
["イグザレルト錠15ｍｇ","バイエル",null,"▲","b",null,"b",{"$nulls":5},"イグザレルト錠15ｍｇ"]
["イクスタンジカプセル40ｍｇ","アステラス",null,"×","g",null,null,"g",null,null,"抗がん剤/難水性の溶剤を充填","調製者の暴露に注意","イクスタンジカプセル40ｍｇ"]
["イコサペント酸エチル粒状カプセル９００ｍｇ　「サワイ」",{"$nulls":3},"b",null,"b",{"$nulls":5},"イコサペント酸エチル粒状カプセル９００ｍｇ　「サワイ」"]
["イスコチン錠100ｍｇ",null,null,"●","b",null,"b",{"$nulls":5},"イスコチン錠100ｍｇ"]
["イスコチン末１００％　１００ｇ","第一三共",null,null,"b",{"$nulls":3},"b",{"$nulls":3},"イスコチン末１００％　１００ｇ"]
["イトラコナゾール錠100「ＭＥＥＫ」","Ｍｅｉｊｉ","小林化工","▲","c ",null,null,"c ",{"$nulls":4},"イトラコナゾール錠100「ＭＥＥＫ」"]
["イノベロン錠200ｍｇ","エーザイ",null,"▲","b",null,null,"b",null,null,"沈殿性浮遊物あるが8Fr.通過",null,"イノベロン錠200ｍｇ"]
["イミグラン錠５０","グラクソ",null,"▲","b",null,"b","b",{"$nulls":4},"イミグラン錠５０"]
["イムセラカプセル0.5mg","田辺三菱",null,"×","g","g",{"$nulls":4},"必要時相談",null,"イムセラカプセル0.5mg"]
["イムラン錠50ｍｇ",null,null,"▲","b",null,"b",{"$nulls":4},"多めの水でフラッシュ","イムラン錠50ｍｇ"]
["イメンドカプセル 80ｍｇ","小野",null,"×","g","g",{"$nulls":4},"プロイメンドあり",null,"イメンドカプセル 80ｍｇ"]
["イメンドカプセル125ｍｇ","小野",null,"×","g","g",{"$nulls":4},"プロイメンドあり",null,"イメンドカプセル125ｍｇ"]
["イリボーＯＤ錠５μｇ","アステラス",null,"▲","b",null,null,"b",null,null,"ガラス容器だと吸着","使用容器に注意！ガラス容器だと吸着","イリボーＯＤ錠５μｇ"]
["イレッサ錠２５０","アストラゼネカ",null,"×","b",null,"b",{"$nulls":3},"抗がん剤","調製者の暴露に注意","イレッサ錠２５０"]
["インタール細粒１０％","サノフィ",null,null,"b",{"$nulls":3},"b",{"$nulls":3},"インタール細粒１０％"]
["インデラル錠１０ｍｇ",null,null,"▲","b",null,"b",{"$nulls":5},"インデラル錠１０ｍｇ"]
["インフリーＳカプセル２００ｍｇ",null,null,"▲","b",null,"b",{"$nulls":5},"インフリーＳカプセル２００ｍｇ"]
["インライタ錠１ｍｇ","ファイザー",null,"×","g",{"$nulls":3},"g",null,"抗がん剤","調製者の暴露に注意","インライタ錠１ｍｇ"]
["インライタ錠５ｍｇ","ファイザー",null,"×","g",{"$nulls":3},"g",null,"抗がん剤","調製者の暴露に注意","インライタ錠５ｍｇ"]
["ヴアイデックスＥＣカプセル１２５　","ブリストルマイヤーズ",null,"×","g",null,"g",{"$nulls":3},"HIV",null,"ヴアイデックスＥＣカプセル１２５　"]
["ヴォトリエント錠200ｍｇ","グラクソ",null,"×","g",null,null,"g",null,null,"抗がん剤/粉砕するとCmax/AUC増加する","調製者の暴露に注意","ヴォトリエント錠200ｍｇ"]
["ウテメリン　５ｍｇ　",null,null,"▲","b",null,"b",{"$nulls":5},"ウテメリン　５ｍｇ　"]
["ウブレチド錠　５ｍｇ",null,null,"▲","b",null,"b",{"$nulls":5},"ウブレチド錠　５ｍｇ"]
["ウラリット配合錠",null,null,"●","c",null,"c",{"$nulls":5},"ウラリット配合錠"]
["ウリトスＯＤ錠　０．１ｍｇ","杏林",null,"▲","b",null,null,"b",{"$nulls":4},"ウリトスＯＤ錠　０．１ｍｇ"]
["ウルソ錠１００ｍｇ",null,null,"●","b",null,"b",{"$nulls":5},"ウルソ錠１００ｍｇ"]
["ウロカルン錠２２５ｍｇ",null,null,"▲","b",null,"b",{"$nulls":5},"ウロカルン錠２２５ｍｇ"]
["エクア錠　５０ｍｇ","ノバルティス",null,"●","b",{"$nulls":3},"b",{"$nulls":3},"エクア錠　５０ｍｇ"]
["エクジェイド懸濁用５００ｍｇ","ノバルティス",null,"×","g","g",{"$nulls":4},"懸濁に100mL必要",null,"エクジェイド懸濁用５００ｍｇ"]
["エクセグラン散　２０％",{"$nulls":3},"b",null,"b",{"$nulls":5},"エクセグラン散　２０％"]
["エクセグラン錠１００ｍｇ",null,null,"▲","b",null,"b",{"$nulls":5},"エクセグラン錠１００ｍｇ"]
["エジュラント錠25ｍｇ","ヤンセン",null,"×","g","g",{"$nulls":4},"HIV/固形物摂取が必要",null,"エジュラント錠25ｍｇ"]
["エスカゾール錠200ｍｇ","グラクソ",null,"▲","b",null,null,"b",{"$nulls":4},"エスカゾール錠200ｍｇ"]
["エストラサイトカプセル　１５６．７ｍｇ","日新",null,"×","b",null,"b",{"$nulls":3},"冷所",null,"エストラサイトカプセル　１５６．７ｍｇ"]
["エチゾラム錠0.5ｍｇ「ＥＭＥＣ」",null,null,"●","b",null,"b",{"$nulls":5},"エチゾラム錠0.5ｍｇ「ＥＭＥＣ」"]
["エディロールカプセル０．７５μｇ","中外",null,"▲","g",null,null,"g",{"$nulls":4},"エディロールカプセル０．７５μｇ"]
["エナラプリルＭ錠５「ＥＭＥＣ」","エルドメットエーザイ",null,"●","b",null,null,"b",{"$nulls":4},"エナラプリルＭ錠５「ＥＭＥＣ」"]
["エバステル錠１０ｍｇ",null,null,"▲","b",null,"b",{"$nulls":5},"エバステル錠１０ｍｇ"]
["エピビル錠　１５０ｍｇ","グラクソ","ヴィープ","×","b",null,"b","b",null,null,"HIV",null,"エピビル錠　１５０ｍｇ"]
["エビプロスタット配合錠ＤＢ",null,null,"▲","g",null,"g",{"$nulls":5},"エビプロスタット配合錠ＤＢ"]
["エフィエント錠3.75ｍｇ","第一三共",null,"●","e",null,null,"e",null,null,"30℃10分（30分おくのは不可）55℃10分放置は類縁物質増加",null,"エフィエント錠3.75ｍｇ"]
["エフィエント錠5ｍｇ","第一三共",null,"▲","e",null,null,"e",null,null,"30℃10分（30分おくのは不可）55℃10分放置は類縁物質増加",null,"エフィエント錠5ｍｇ"]
["エプジコム錠","ヴィーブ",null,"×","c",null,"c",{"$nulls":3},"HIV",null,"エプジコム錠"]
["エブトール２５０ｍｇ錠　",null,null,"●","g",null,"g",{"$nulls":5},"エブトール２５０ｍｇ錠　"]
["エフピ－ＯＤ錠２．５ｍｇ","エフピー",null,"×","b",null,null,"b",null,null,"覚せい剤原料","調製者の暴露に注意","エフピ－ＯＤ錠２．５ｍｇ"]
["エブランチルカプセル１５ｍｇ　",null,null,"▲","e",null,"e",{"$nulls":4},"多めの水でフラッシュ","エブランチルカプセル１５ｍｇ　"]
["エリキュース錠（2.5ｍｇ）","ブリストルマイヤーズ",null,"●","b",null,"b",{"$nulls":5},"エリキュース錠（2.5ｍｇ）"]
["エリキュース錠（5ｍｇ）","ブリストルマイヤーズ",null,"●","b",null,"b",{"$nulls":5},"エリキュース錠（5ｍｇ）"]
["エリスロシン錠（２００ｍｇ）",null,null,"▲","c",null,"c",{"$nulls":5},"エリスロシン錠（２００ｍｇ）"]
["エルカルチンFF錠１００ｍｇ","大塚",null,"×","c",null,null,"c",{"$nulls":4},"エルカルチンFF錠１００ｍｇ"]
["エンドキサン錠　５０ｍｇ",null,null,"×","g",null,"g",{"$nulls":3},"抗がん剤","調製者の暴露に注意","エンドキサン錠　５０ｍｇ"]
["オイグルコン錠１．２５ｍｇ","中外",null,"▲","b",null,"b",{"$nulls":5},"オイグルコン錠１．２５ｍｇ"]
["オーグメンチン配合錠２５０ＲＳ　（３７５ｍｇ）","グラクソ",null,"×","g",null,"g","g",null,null,"吸湿性強い",null,"オーグメンチン配合錠２５０ＲＳ　（３７５ｍｇ）"]
["オ－クル錠　１００ｍｇ",null,null,"▲","c",null,"c",{"$nulls":5},"オ－クル錠　１００ｍｇ"]
["オゼックス細粒小児用１５％","大正富山",null,null,"b",null,null,"b",null,null,"データないが水に溶解するためOKと思われる",null,"オゼックス細粒小児用１５％"]
["オダイン錠　１２５ｍｇ",null,null,"×","b",null,"b",{"$nulls":3},"抗がん剤","調製者の暴露に注意","オダイン錠　１２５ｍｇ"]
["オラセフ錠　２５０ｍｇ",null,null,"×","b",null,"b",{"$nulls":5},"オラセフ錠　２５０ｍｇ"]
["オルメテック錠２０ｍｇ","第一三共",null,"●","b",null,null,"b",{"$nulls":4},"オルメテック錠２０ｍｇ"]
["オロパタジン塩酸塩ＯＤ錠5mg「明治」","Ｍｅｉｊｉ",null,"●","b",null,"b",{"$nulls":5},"オロパタジン塩酸塩ＯＤ錠5mg「明治」"]
["カイトリル錠２ｍｇ",null,null,"×",{"$f":"IF(F131&G131&H131&H131&I131&J131=\"\",\"\",IF(F131&G131&H131&I131=\"\",J131,IF(F131&G131&H131=\"\",I131,(IF(F131&G131=\"\",H131,IF(F131=\"\",G131,F131))))))","v":"b"},null,"b",{"$nulls":5},"カイトリル錠２ｍｇ"]
["ガスター散１０％　１００ｇ","アステラス",null,null,"b",{"$nulls":3},"b",{"$nulls":3},"ガスター散１０％　１００ｇ"]
["ガステール　４０ｍｇ","扶桑",null,"▲","b",null,"b",{"$nulls":5},"ガステール　４０ｍｇ"]
["ガストローム顆粒　６６．７％",{"$nulls":3},"g",null,"g",{"$nulls":5},"ガストローム顆粒　６６．７％"]
["ガスロンＮ錠４ｍｇ　",null,null,"●","b",null,"b",{"$nulls":5},"ガスロンＮ錠４ｍｇ　"]
["カソデックスＯＤ錠８０ｍｇ",null,null,"×","g",null,"g",{"$nulls":3},"抗がん剤","調製者の暴露に注意","カソデックスＯＤ錠８０ｍｇ"]
["カタプレス錠７５　０．０７５ｍｇ",null,null,"×","b",null,"b",{"$nulls":5},"カタプレス錠７５　０．０７５ｍｇ"]
["カチーフＮ錠５ｍｇ",null,null,"▲","b",null,"b",{"$nulls":5},"カチーフＮ錠５ｍｇ"]
["ガナトン錠５０ｍｇ",null,null,"●","c",null,"c",{"$nulls":5},"ガナトン錠５０ｍｇ"]
["カナマイシンカプセル明治　２５０ｍｇ",null,null,"▲","b",null,"b",{"$nulls":5},"カナマイシンカプセル明治　２５０ｍｇ"]
["カバサ－ル錠　１ｍｇ",null,null,"▲","b",null,"b",{"$nulls":5},"カバサ－ル錠　１ｍｇ"]
["ガバペン錠２００ｍｇ","ファイザー",null,"▲","c",null,null,"c",null,null,"120mlのフラッシュで残留無し","多めの水でフラッシュ","ガバペン錠２００ｍｇ"]
["ガバペン錠３００ｍｇ","ファイザー",null,"▲","c",null,null,"c",null,null,"180ｍｌのフラッシュで残留無し","多めの水でフラッシュ","ガバペン錠３００ｍｇ"]
["カプトリル錠１２．５ｍｇ","第一三共エスファ",null,"▲","b",{"$nulls":3},"b",{"$nulls":3},"カプトリル錠１２．５ｍｇ"]
["ガランターゼ散　５０％　０．５ｇ","田辺製薬販売",null,null,"g","g",{"$nulls":4},"酵素製剤であり55℃では失活",null,"ガランターゼ散　５０％　０．５ｇ"]
["カルグート錠　５ｍｇ",null,null,"▲","b",null,"b",{"$nulls":5},"カルグート錠　５ｍｇ"]
["カルタンＯＤ錠５００ｍｇ","マイラン",null,"●","b",null,"b",{"$nulls":5},"カルタンＯＤ錠５００ｍｇ"]
["カルデナリン錠１ｍｇ",null,null,"●","b",null,"b",{"$nulls":5},"カルデナリン錠１ｍｇ"]
["カルナクリン錠５０　５０国際単位",null,null,"▲","g",null,"g",{"$nulls":5},"カルナクリン錠５０　５０国際単位"]
["カルブロック錠１６ｍｇ",null,null,"●","c",null,"c",{"$nulls":5},"カルブロック錠１６ｍｇ"]
["カルボシステイン錠250ｍｇ「テバ」","テバ",null,"●","b",null,"b",{"$nulls":5},"カルボシステイン錠250ｍｇ「テバ」"]
["カレトラ配合錠","アッヴィ合同",null,"×","g",null,"g",{"$nulls":3},"HIV",null,"カレトラ配合錠"]
["カロナール錠　２００ｍｇ",null,null,"●","b",null,"b",{"$nulls":5},"カロナール錠　２００ｍｇ"]
["カンデサルタン錠８ｍｇ「あすか」","あすか",null,"●","b",null,null,"b",{"$nulls":4},"カンデサルタン錠８ｍｇ「あすか」"]
["キネダック錠　５０ｍｇ",null,null,"▲","b",null,"b",{"$nulls":5},"キネダック錠　５０ｍｇ"]
["きゅう帰調血飲エキス顆粒","太虎精堂",null,null,"b",null,null,"b",{"$nulls":4},"きゅう帰調血飲エキス顆粒"]
["クエチアピン錠25ｍｇ「ＤＳＥＰ」",null,null,"●","b",null,"b",{"$nulls":5},"クエチアピン錠25ｍｇ「ＤＳＥＰ」"]
["グッドミン錠０．２５ｍｇ",null,null,"●","b",null,"b",{"$nulls":5},"グッドミン錠０．２５ｍｇ"]
["グラケ－カプセル１５ｍｇ　",null,null,"▲","b",null,"b",{"$nulls":5},"グラケ－カプセル１５ｍｇ　"]
["クラシエ十全大補湯エキス細粒",{"$nulls":3},"b",null,"b",{"$nulls":5},"クラシエ十全大補湯エキス細粒"]
["クラシエ当帰芍薬散料エキス細粒　２ｇ","クラシエ",null,null,"b",null,null,"b",{"$nulls":4},"クラシエ当帰芍薬散料エキス細粒　２ｇ"]
["クラシエ半夏厚朴湯","クラシエ",null,null,"b",null,null,"b",{"$nulls":4},"クラシエ半夏厚朴湯"]
["クラシエ芍薬甘草湯エキス細粒",{"$nulls":3},"b",null,"b",{"$nulls":5},"クラシエ芍薬甘草湯エキス細粒"]
["グラマリール錠２５ｍｇ　",null,null,"▲","c",null,"c",{"$nulls":5},"グラマリール錠２５ｍｇ　"]
["クラリシッド錠２００ｍｇ","アボット",null,"▲","b",null,null,"b",null,null,"クラリス同等",null,"クラリシッド錠２００ｍｇ"]
["グランダキシン錠５０ｍｇ　",null,null,"▲","g",null,"g",{"$nulls":5},"グランダキシン錠５０ｍｇ　"]
["グリチロン配合錠",null,null,"●","c",null,"c",{"$nulls":5},"グリチロン配合錠"]
["グリベック錠１００ｍｇ",null,null,"×","b",null,"b",{"$nulls":3},"抗がん剤","調製者の暴露に注意","グリベック錠１００ｍｇ"]
["グリミクロン錠　４０ｍｇ",null,null,"▲","b",null,"b",{"$nulls":5},"グリミクロン錠　４０ｍｇ"]
["グルコバイ錠５０ｍｇ",null,null,"×","b",null,"b",{"$nulls":5},"グルコバイ錠５０ｍｇ"]
["グルコンサンＫ細粒　４ｍEq/g",{"$nulls":3},"b",null,"b",{"$nulls":5},"グルコンサンＫ細粒　４ｍEq/g"]
["グルファスト錠　１０ｍｇ","キッセイ",null,"▲","b",null,"b",{"$nulls":5},"グルファスト錠　１０ｍｇ"]
["クレストール錠２．５ｍｇ","アストラゼネカ",null,"●","b",{"$nulls":3},"b",{"$nulls":3},"クレストール錠２．５ｍｇ"]
["クレメジンカプセル２００ｍｇ",null,null,"×","e",null,"e",null,null,"○",null,null,"クレメジンカプセル２００ｍｇ"]
["クレメジン細粒分包２ｇ",{"$nulls":3},"e",null,"e",{"$nulls":4},"混ぜながら注入","クレメジン細粒分包２ｇ"]
["ケイキサレート散　５ｇ",{"$nulls":3},"e",null,"e",{"$nulls":4},"半包あたり水20ｍｌに混ぜながら注入","ケイキサレート散　５ｇ"]
["ケーサプライ錠600mg","アルフレッサ","佐藤薬品","●","g","g",{"$nulls":4},"徐放",null,"ケーサプライ錠600mg"]
["ケタスカプセル１０ｍｇ",null,null,"▲","b",null,"b",{"$nulls":5},"ケタスカプセル１０ｍｇ"]
["ケフラールカプセル２５０ｍｇ",null,null,"▲","b",null,"b",{"$nulls":5},"ケフラールカプセル２５０ｍｇ"]
["ケフラール細粒小児用１００ｍｇ",{"$nulls":3},"b",null,"b",{"$nulls":5},"ケフラール細粒小児用１００ｍｇ"]
["コデインリン酸塩「タケダ」　１％","武田",null,null,"b",{"$nulls":3},"b",null,"「タケダ」のデータはないが他施設DBでほぼ可となっている",null,"コデインリン酸塩「タケダ」　１％"]
["コ－トリル錠　１０ｍｇ",null,null,"▲","b",null,"b",{"$nulls":5},"コ－トリル錠　１０ｍｇ"]
["コニール錠４",null,null,"●","b",null,"b",{"$nulls":5},"コニール錠４"]
["コペガス錠２００ｍｇ","中外",null,"▲","g",null,null,"g",null,null,"55℃20mL30分放置で懸濁可",null,"コペガス錠２００ｍｇ"]
["コムタン錠１００ｍｇ","ノバルティス",null,"▲","b",null,"b",{"$nulls":5},"コムタン錠１００ｍｇ"]
["コランチル配合顆粒　１ｇ",{"$nulls":3},"b",null,"b",{"$nulls":5},"コランチル配合顆粒　１ｇ"]
["コルヒチン錠「タカタ」　０．５ｍｇ","高田製薬",null,"▲","b",null,"b",{"$nulls":5},"コルヒチン錠「タカタ」　０．５ｍｇ"]
["コレアジン錠12.5ｍｇ","アルフレッサ",null,"▲","b",null,null,"b",{"$nulls":4},"コレアジン錠12.5ｍｇ"]
["コレバインミニ８３％　１．８１ｇ",{"$nulls":3},"g",null,"g",{"$nulls":5},"コレバインミニ８３％　１．８１ｇ"]
["コロネル錠　５００ｍｇ",null,null,"▲","g",null,"g",{"$nulls":5},"コロネル錠　５００ｍｇ"]
["コントール散１％","武田",null,null,"",{"$nulls":7},"コントール散１％"]
["コントミン糖衣錠　１２．５ｍｇ",null,null,"▲","c",null,"c",{"$nulls":5},"コントミン糖衣錠　１２．５ｍｇ"]
["サアミオン錠　５ｍｇ",null,null,"▲","c",null,"c",{"$nulls":5},"サアミオン錠　５ｍｇ"]
["ザイアジェン錠３００ｍｇ","ヴィーブ",null,"×","b",null,"b",{"$nulls":3},"HIV",null,"ザイアジェン錠３００ｍｇ"]
["ザイザル錠５ｍｇ","グラクソ",null,"●",{"$f":"IF(F195&G195&H195&H195&I195&J195=\"\",\"\",IF(F195&G195&H195&I195=\"\",J195,IF(F195&G195&H195=\"\",I195,(IF(F195&G195=\"\",H195,IF(F195=\"\",G195,F195))))))","v":"b"},null,"b","b",{"$nulls":4},"ザイザル錠５ｍｇ"]
["ザイティガ錠250ｍｇ","ヤンセン",null,"×","g",{"$nulls":3},"g",null,"抗がん剤","調製者の暴露に注意","ザイティガ錠250ｍｇ"]
["サイトテック錠２００",null,null,"▲","b",null,"b",{"$nulls":5},"サイトテック錠２００"]
["ザイボックス錠６００ｍｇ","ファイザー",null,"×","b",null,"b",{"$nulls":5},"ザイボックス錠６００ｍｇ"]
["サイレース錠１ｍｇ　",null,null,"▲","b",null,"b",{"$nulls":5},"サイレース錠１ｍｇ　"]
["サインバルタカプセル２０ｍｇ","リリー","塩野義","▲","g",null,"g",{"$nulls":5},"サインバルタカプセル２０ｍｇ"]
["ザジテンＤＳ　０．１％","ノバルティスファーマ",null,null,"b",{"$nulls":3},"b",null,"表面に白いものが残る",null,"ザジテンＤＳ　０．１％"]
["サムスカ錠１５ｍｇ","大塚",null,"▲","b",null,null,"b",null,null,"口渇を感じない患者は禁忌",null,"サムスカ錠１５ｍｇ"]
["サムスカ錠7.5ｍｇ","大塚",null,"▲","b",null,null,"b",null,null,"口渇を感じない患者は禁忌",null,"サムスカ錠7.5ｍｇ"]
["サラゾピリン錠　５００ｍｇ",null,null,"▲","b",null,"b",{"$nulls":5},"サラゾピリン錠　５００ｍｇ"]
["ザルティア錠5ｍｇ","リリー",null,"▲","b",null,null,"b",{"$nulls":4},"ザルティア錠5ｍｇ"]
["サレドカプセル１００ｍｇ","藤本製薬",null,"×","b",null,"b",{"$nulls":3},"抗がん剤","調製者の暴露に注意","サレドカプセル１００ｍｇ"]
["サレドカプセル５０ｍｇ","藤本製薬",null,"×","b",null,"b",{"$nulls":3},"抗がん剤","調製者の暴露に注意","サレドカプセル５０ｍｇ"]
["サワシリン細粒　１００ｍｇ",{"$nulls":3},"b",null,"b",{"$nulls":5},"サワシリン細粒　１００ｍｇ"]
["酸化マグネシウム「シオエ」","日本新薬","シオエ",null,"b",{"$nulls":3},"b",null,"詰まりやすい　マグラックスへ変更推奨",null,"酸化マグネシウム「シオエ」"]
["ザンタック錠　１５０",null,null,"×","c",null,"c",{"$nulls":5},"ザンタック錠　１５０"]
["サンリズムカプセル２５ｍｇ",null,null,"●","b",null,"b",{"$nulls":3},"局所麻酔作用あり、舌のしびれ・食道膨脹のおそれあり",null,"サンリズムカプセル２５ｍｇ"]
["ジアゾキシドカプセル25ｍｇ「ＭＳＤ」","MSD",null,"▲","g",{"$nulls":3},"g",{"$nulls":3},"ジアゾキシドカプセル25ｍｇ「ＭＳＤ」"]
["シーエルセントリ錠125ｍｇ","ヴィーブ",null,"×","b",null,"b",{"$nulls":3},"HIV",null,"シーエルセントリ錠125ｍｇ"]
["ジェイゾロフト錠２５ｍｇ","ファイザー",null,"▲","g",null,null,"g",null,null,"シリンジ内付着","多めの水でフラッシュ","ジェイゾロフト錠２５ｍｇ"]
["ジェニナック錠２００ｍｇ","大正富山",null,"▲","b",null,null,"b",{"$nulls":4},"ジェニナック錠２００ｍｇ"]
["ジオトリフ錠20ｍｇ","ベーリンガー",null,"×","g","g",{"$nulls":4},"抗がん剤/懸濁液の安定性（55℃10ｍｌ10分）はあるがチューブ通過は確認なし/必要時相談","調製者の暴露に注意","ジオトリフ錠20ｍｇ"]
["ジオトリフ錠30ｍｇ","ベーリンガー",null,"×","g","g",{"$nulls":4},"抗がん剤/懸濁液の安定性（55℃10ｍｌ10分）はあるがチューブ通過は確認なし/必要時相談","調製者の暴露に注意","ジオトリフ錠30ｍｇ"]
["ジオトリフ錠40ｍｇ","ベーリンガー",null,"×","g","g",{"$nulls":4},"抗がん剤/懸濁液の安定性（55℃10ｍｌ10分）はあるがチューブ通過は確認なし/必要時相談","調製者の暴露に注意","ジオトリフ錠40ｍｇ"]
["ジオトリフ錠50ｍｇ","ベーリンガー",null,"×","g","g",{"$nulls":4},"抗がん剤/懸濁液の安定性（55℃10ｍｌ10分）はあるがチューブ通過は確認なし/必要時相談","調製者の暴露に注意","ジオトリフ錠50ｍｇ"]
["ジゴシン１０００倍散　０．１％","中外",null,null,"b",{"$nulls":3},"b",{"$nulls":3},"ジゴシン１０００倍散　０．１％"]
["ジスロマックカプセル小児用１００ｍｇ",null,null,"▲","b",null,"b",{"$nulls":5},"ジスロマックカプセル小児用１００ｍｇ"]
["ジスロマック細粒　小児用",{"$nulls":3},"b",null,"b",{"$nulls":5},"ジスロマック細粒　小児用"]
["ジスロマック錠２５０ｍｇ　",null,null,"×","b",null,"b",{"$nulls":3},"特殊",null,"ジスロマック錠２５０ｍｇ　"]
["シナール配合顆粒　１ｇ",{"$nulls":3},"b",null,"b",{"$nulls":5},"シナール配合顆粒　１ｇ"]
["ジプレキサ錠２．５ｍｇ","リリー",null,"▲","b",{"$nulls":3},"b",{"$nulls":3},"ジプレキサ錠２．５ｍｇ"]
["シプロキサン錠１００ｍｇ",null,null,"▲","b",null,"b",{"$nulls":5},"シプロキサン錠１００ｍｇ"]
["シベノール錠５０ｍｇ　",null,null,"▲","b",null,"b",{"$nulls":5},"シベノール錠５０ｍｇ　"]
["ジャカビ錠5ｍｇ","ノバルティス",null,"×","g","g",{"$nulls":4},"抗がん剤/必要時相談","調製者の暴露に注意","ジャカビ錠5ｍｇ"]
["ジャヌビア錠　５０ｍｇ",null,null,"●","b",null,"b",{"$nulls":5},"ジャヌビア錠　５０ｍｇ"]
["ジルテック錠１０","UCジャパン",null,"●","b",null,"b",{"$nulls":5},"ジルテック錠１０"]
["シングレアチュアブル錠５","MSD",null,"×","g",null,null,"g",null,null,"キプレスと同等、不適",null,"シングレアチュアブル錠５"]
["シングレア細粒４ｍｇ","MSD",null,null,"g",null,"g",{"$nulls":3},"キプレス錠不可のため細粒も不可と考えられる",null,"シングレア細粒４ｍｇ"]
["シングレア錠１０　１０ｍｇ","MSD",null,"▲","g",null,null,"g",null,null,"キプレスと同等、不適",null,"シングレア錠１０　１０ｍｇ"]
["シンセロン錠８ｍｇ","杏林",null,"×","b",{"$nulls":3},"b",{"$nulls":3},"シンセロン錠８ｍｇ"]
["シンメトレル細粒１０％",{"$nulls":3},"b",null,"b",{"$nulls":5},"シンメトレル細粒１０％"]
["シンメトレル錠５０ｍｇ",null,null,"▲","b",null,"b",{"$nulls":5},"シンメトレル錠５０ｍｇ"]
["スーテントカプセル１２．５ｍｇ","ファイザー",null,"×","b",null,"b",{"$nulls":3},"抗がん剤","調製者の暴露に注意","スーテントカプセル１２．５ｍｇ"]
["スタラシドカプセル５０ｍｇ","日本化薬",null,"×","b",null,"b",{"$nulls":3},"抗がん剤","調製者の暴露に注意","スタラシドカプセル５０ｍｇ"]
["スタリビルド配合錠","日本たばこ産業",null,"×","e",null,null,"e",null,null,"HIV/常温で","常温の水で懸濁","スタリビルド配合錠"]
["スチバーガ錠40ｍｇ","バイエル",null,"×","g",{"$nulls":3},"g",null,"抗がん剤","調製者の暴露に注意","スチバーガ錠40ｍｇ"]
["ストックリン錠２００ｍｇ","MSD",null,"×","g",null,"g",{"$nulls":3},"HIV　600mg参照",null,"ストックリン錠２００ｍｇ"]
["ストックリン錠６００ｍｇ","MSD",null,"×","g",null,"g",{"$nulls":3},"HIV",null,"ストックリン錠６００ｍｇ"]
["ストロメクトール錠　３ｍｇ","マルホ","MSD","▲","b",null,"b",{"$nulls":5},"ストロメクトール錠　３ｍｇ"]
["ズファジラン錠10ｍｇ","第一三共",null,"▲","b",null,"b",{"$nulls":5},"ズファジラン錠10ｍｇ"]
["スプリセル錠２０ｍｇ","ブリストルマイヤーズ",null,"×","b",null,"b",{"$nulls":3},"抗がん剤","調製者の暴露に注意","スプリセル錠２０ｍｇ"]
["スンベプラカプセル100ｍｇ","ブリストルマイヤーズ",null,"×","g",{"$nulls":3},"g",null,"油の液体軟カプセルのため不可",null,"スンベプラカプセル100ｍｇ"]
["セイブル錠　５０ｍｇ","三和化学",null,"▲","c",null,null,"c",{"$nulls":4},"セイブル錠　５０ｍｇ"]
["ゼチーア錠１０ｍｇ","MSD",null,"●","b",{"$nulls":3},"b",null,"原薬は脂溶性",null,"ゼチーア錠１０ｍｇ"]
["セディ－ル錠１０ｍｇ",null,null,"▲","b",null,"b",{"$nulls":5},"セディ－ル錠１０ｍｇ"]
["セパゾン錠２",null,null,"▲","b",null,"b",{"$nulls":5},"セパゾン錠２"]
["セファドール錠　２５ｍｇ　",null,null,"●","b",null,"b",{"$nulls":5},"セファドール錠　２５ｍｇ　"]
["セフカペンピボキシル塩酸塩錠100mg「ファイザー」","マイラン",null,"×","b",null,null,"b",null,null,"残留粒子あるが押し込める",null,"セフカペンピボキシル塩酸塩錠100mg「ファイザー」"]
["セフジニル錠100mg「サワイ」","沢井",null,"●","b",null,"b",{"$nulls":5},"セフジニル錠100mg「サワイ」"]
["セフゾン細粒小児用１０％　２００ｇ",{"$nulls":3},"b",null,"b",{"$nulls":5},"セフゾン細粒小児用１０％　２００ｇ"]
["セララ錠２５ｍｇ","ファイザー",null,"●","b",null,"b",{"$nulls":5},"セララ錠２５ｍｇ"]
["ゼリットカプセル　１５ｍｇ","ブリストルマイヤーズ",null,"×","b",null,"b",{"$nulls":3},"HIV",null,"ゼリットカプセル　１５ｍｇ"]
["ゼリットカプセル２０ｍｇ","ブリストルマイヤーズ",null,"×","b",null,"b",{"$nulls":3},"HIV",null,"ゼリットカプセル２０ｍｇ"]
["セルシン錠　２ｍｇ",null,null,"●","b",null,"b",{"$nulls":5},"セルシン錠　２ｍｇ"]
["セルセプトカプセル250ｍｇ","中外",null,"▲",{"$f":"IF(F259&G259&H259&H259&I259&J259=\"\",\"\",IF(F259&G259&H259&I259=\"\",J259,IF(F259&G259&H259=\"\",I259,(IF(F259&G259=\"\",H259,IF(F259=\"\",G259,F259))))))","v":"b"},null,null,"b",{"$nulls":4},"セルセプトカプセル250ｍｇ"]
["セレキノン錠　１００ｍｇ",null,null,"▲","g",null,"g",{"$nulls":5},"セレキノン錠　１００ｍｇ"]
["セレクト－ル錠２００ｍｇ",null,null,"▲","c",null,"c",{"$nulls":5},"セレクト－ル錠２００ｍｇ"]
["セレコックス錠１００ｍｇ","アステラス",null,"●","c",null,null,"c",{"$nulls":4},"セレコックス錠１００ｍｇ"]
["セレジスト錠５ｍｇ",null,null,"▲","b",null,"b",{"$nulls":5},"セレジスト錠５ｍｇ"]
["セレスタミン配合錠",null,null,"▲","b",null,"b",{"$nulls":5},"セレスタミン配合錠"]
["セレニカＲ顆粒　４０％",{"$nulls":3},"g",null,"g",{"$nulls":5},"セレニカＲ顆粒　４０％"]
["セレネース錠　０．７５ｍｇ",null,null,"●","b",null,"b",{"$nulls":5},"セレネース錠　０．７５ｍｇ"]
["ゼローダ錠３００　","中外",null,"×","b",null,"b",{"$nulls":3},"抗がん剤","調製者の暴露に注意","ゼローダ錠３００　"]
["セロクラール錠　１０ｍｇ","日医工",null,"▲","g",null,null,"g",null,null,"20mg錠のデータ参照",null,"セロクラール錠　１０ｍｇ"]
["セロケン錠２０ｍｇ",null,null,"▲","b",null,"b",{"$nulls":5},"セロケン錠２０ｍｇ"]
["セロトーン錠１０ｍｇ",null,null,"×","b",null,"b",{"$nulls":5},"セロトーン錠１０ｍｇ"]
["センノサイド錠（大正薬品）　１２ｍｇ",null,null,"●","c",null,"c",{"$nulls":5},"センノサイド錠（大正薬品）　１２ｍｇ"]
["ソセゴン錠２５ｍｇ","丸石",null,"×","g","g",{"$nulls":4},"向精神薬2種 ソセゴン注あり",null,"ソセゴン錠２５ｍｇ"]
["ソタコール錠４０ｍｇ","ブリストルマイヤーズ",null,"▲","b",null,null,"b",{"$nulls":4},"ソタコール錠４０ｍｇ"]
["ゾビラックス錠　２００ｍｇ",null,null,"▲","b",null,"b",{"$nulls":5},"ゾビラックス錠　２００ｍｇ"]
["ソブリアードカプセル100ｍｇ","ヤンセン",null,"×","g",{"$nulls":3},"g",null,"データなし　症例あった時に要相談",null,"ソブリアードカプセル100ｍｇ"]
["ソラナックス０．４ｍｇ錠",null,null,"●","b",null,"b",{"$nulls":5},"ソラナックス０．４ｍｇ錠"]
["ソランタール錠１００ｍｇ",null,null,"▲","c",null,"c",{"$nulls":5},"ソランタール錠１００ｍｇ"]
["ゾルピデム酒石酸塩OD錠5mg「サワイ」","沢井",null,"●","b",null,"b",{"$nulls":5},"ゾルピデム酒石酸塩OD錠5mg「サワイ」"]
["ダイアート錠６０ｍｇ",null,null,"●","b",null,"b",{"$nulls":5},"ダイアート錠６０ｍｇ"]
["ダイアモックス錠２５０ｍｇ",null,null,"▲","b",null,"b",{"$nulls":5},"ダイアモックス錠２５０ｍｇ"]
["タイケルブ錠　２５０ｍｇ","グラクソ",null,"×","b",null,"b","b",null,null,"抗がん剤","調製者の暴露に注意","タイケルブ錠　２５０ｍｇ"]
["タウリン散９８％「大正」",{"$nulls":3},"e",null,"e",{"$nulls":4},"混ぜながら注入","タウリン散９８％「大正」"]
["ダグルインザ錠60ｍｇ","ブリストルマイヤーズ",null,"×","g",{"$nulls":3},"g",{"$nulls":3},"ダグルインザ錠60ｍｇ"]
["タシグナカプセル１５０ｍｇ","ノバルティス",null,"×","b",null,"b",{"$nulls":3},"抗がん剤","調製者の暴露に注意","タシグナカプセル１５０ｍｇ"]
["タシグナカプセル２００ｍｇ","ノバルティス",null,"×","b",null,"b",{"$nulls":3},"抗がん剤","調製者の暴露に注意","タシグナカプセル２００ｍｇ"]
["タナド－パ顆粒　１ｇ",{"$nulls":3},"g",null,"g",{"$nulls":5},"タナド－パ顆粒　１ｇ"]
["タナトリル錠５",null,null,"●","c",null,"c",{"$nulls":5},"タナトリル錠５"]
["タミフルカプセル７５ｍｇ",null,null,"×","b",null,"b",{"$nulls":5},"タミフルカプセル７５ｍｇ"]
["タミフルドライシロップ３％","中外",null,null,"b",{"$nulls":3},"b",{"$nulls":3},"タミフルドライシロップ３％"]
["ダラシンカプセル　１５０ｍｇ",null,null,"●","b",null,"b",{"$nulls":5},"ダラシンカプセル　１５０ｍｇ"]
["タリオン錠１０　１０ｍｇ","田辺三菱",null,"●","g",null,null,"g",{"$nulls":4},"タリオン錠１０　１０ｍｇ"]
["タルセバ錠１００ｍｇ","中外",null,"×","b",null,"b",{"$nulls":3},"抗がん剤","調製者の暴露に注意","タルセバ錠１００ｍｇ"]
["タルセバ錠１５０ｍｇ","中外",null,"×","b",null,"b",{"$nulls":3},"抗がん剤","調製者の暴露に注意","タルセバ錠１５０ｍｇ"]
["タルセバ錠２５ｍｇ","中外",null,"×","b",null,"b",{"$nulls":3},"抗がん剤","調製者の暴露に注意","タルセバ錠２５ｍｇ"]
["ダントリウムカプセル２５",null,null,"▲","b",null,"b",{"$nulls":5},"ダントリウムカプセル２５"]
["タンニン酸アルブミン","日本新薬","シオエ",null,"e",null,null,"e",null,null,"55℃では凝固するため常温の水で懸濁","常温の水で懸濁","タンニン酸アルブミン"]
["タンボコ－ル錠　５０ｍｇ",null,null,"▲","b",null,"b",{"$nulls":5},"タンボコ－ル錠　５０ｍｇ"]
["チザニジン錠1mg「サワイ」","沢井",null,"▲","b",null,"b",{"$nulls":5},"チザニジン錠1mg「サワイ」"]
["チャンピックス錠０．５ｍｇ","ファイザー",null,"×","b",null,null,"b",null,null,"フラッシュ120ｍｌ必要（ガストロは詰まるかも）","多めの水でフラッシュ","チャンピックス錠０．５ｍｇ"]
["チャンピックス錠１ｍｇ","ファイザー",null,"×","b",null,null,"b",null,null,"フラッシュ120ｍｌ必要（ガストロは詰まるかも）","多めの水でフラッシュ","チャンピックス錠１ｍｇ"]
["チラ－ヂンＳ錠５０",null,null,"●","c",null,"c",{"$nulls":5},"チラ－ヂンＳ錠５０"]
["チロナミン錠　５μｇ",null,null,"●","b",null,"b",{"$nulls":5},"チロナミン錠　５μｇ"]
["ツムラ葛根湯エキス顆粒（医療用）",{"$nulls":3},"b",null,"b",{"$nulls":5},"ツムラ葛根湯エキス顆粒（医療用）"]
["ツムラ五苓散エキス顆粒（医療用）",{"$nulls":3},"b",null,"b",{"$nulls":5},"ツムラ五苓散エキス顆粒（医療用）"]
["ツムラ清心蓮子飲エキス顆粒",{"$nulls":3},"b",null,"b",{"$nulls":5},"ツムラ清心蓮子飲エキス顆粒"]
["ツムラ大建中湯エキス顆粒",{"$nulls":3},"b",null,"b",{"$nulls":5},"ツムラ大建中湯エキス顆粒"]
["ツムラ猪苓湯エキス顆粒",{"$nulls":3},"b",null,"b",{"$nulls":5},"ツムラ猪苓湯エキス顆粒"]
["ツムラ麦門冬湯エキス顆粒",{"$nulls":3},"b",null,"b",{"$nulls":5},"ツムラ麦門冬湯エキス顆粒"]
["ツムラ八味地黄丸エキス顆粒（医療用）",{"$nulls":3},"b",null,"b",{"$nulls":5},"ツムラ八味地黄丸エキス顆粒（医療用）"]
["ツムラ半夏瀉心湯エキス",{"$nulls":3},"b",null,"b",{"$nulls":5},"ツムラ半夏瀉心湯エキス"]
["ツムラ補中益気湯エキス顆粒",{"$nulls":3},"b",null,"b",{"$nulls":5},"ツムラ補中益気湯エキス顆粒"]
["ツムラ抑肝散エキス顆粒（２．５ｇ/包）",{"$nulls":3},"b",null,"b",{"$nulls":5},"ツムラ抑肝散エキス顆粒（２．５ｇ/包）"]
["ツムラ六君子湯エキス顆粒　１８９包",{"$nulls":3},"b",null,"b",{"$nulls":5},"ツムラ六君子湯エキス顆粒　１８９包"]
["ティーエスワン配合OD錠T20",null,null,"×","b",null,"b",{"$nulls":3},"抗がん剤","調製者の暴露に注意","ティーエスワン配合OD錠T20"]
["ティーエスワン配合OD錠T25",null,null,"×","b",null,"b",{"$nulls":3},"抗がん剤","調製者の暴露に注意","ティーエスワン配合OD錠T25"]
["ティ－エスワン配合顆粒T２０",{"$nulls":3},"b",null,"b",{"$nulls":5},"ティ－エスワン配合顆粒T２０"]
["ティ－エスワン配合顆粒T２５","大鵬",null,null,"b",null,null,"b",{"$nulls":4},"ティ－エスワン配合顆粒T２５"]
["テオロング錠１００ｍｇ",null,null,"●","b",null,"b",{"$nulls":5},"テオロング錠１００ｍｇ"]
["テオロング錠２００ｍｇ",null,null,"▲","b",null,"b",{"$nulls":5},"テオロング錠２００ｍｇ"]
["デカドロン錠　０．５ｍｇ",null,null,"●","b",null,"b",{"$nulls":5},"デカドロン錠　０．５ｍｇ"]
["テグレトール細粒　５０％",{"$nulls":3},"b",null,"b",{"$nulls":4},"多めの水でフラッシュ","テグレトール細粒　５０％"]
["テグレトール錠　２００ｍｇ",null,null,"●","b",null,"b",{"$nulls":5},"テグレトール錠　２００ｍｇ"]
["テシプール錠　１ｍｇ",null,null,"▲",{"$f":"IF(F323&G323&H323&H323&I323&J323=\"\",\"\",IF(F323&G323&H323&I323=\"\",J323,IF(F323&G323&H323=\"\",I323,(IF(F323&G323=\"\",H323,IF(F323=\"\",G323,F323))))))","v":"b"},null,"b",{"$nulls":5},"テシプール錠　１ｍｇ"]
["デジレル錠２５",null,null,"▲","c",null,"c",{"$nulls":5},"デジレル錠２５"]
["テネリア錠20ｍｇ","田辺",null,"▲","c",null,null,"c",{"$nulls":4},"テネリア錠20ｍｇ"]
["テノーミン　５０ｍｇ",null,null,"▲","b",null,"b",{"$nulls":5},"テノーミン　５０ｍｇ"]
["テノゼット錠300ｍｇ","グラクソ",null,"▲","b",null,null,"b",{"$nulls":4},"テノゼット錠300ｍｇ"]
["デノタスチュアブル配合錠","第一三共",null,"×","c",null,null,"c",null,null,"55℃20mL20回以上破壊して10分で懸濁可",null,"デノタスチュアブル配合錠"]
["デパケンＲ錠１００",null,null,"▲","g",null,"g",{"$nulls":5},"デパケンＲ錠１００"]
["デパケンＲ錠２００",null,null,"●","g",null,"g",{"$nulls":5},"デパケンＲ錠２００"]
["テビケイ錠50ｍｇ","ヴィーブ",null,"×","g","g",{"$nulls":4},"HIV/データないが簡易懸濁必要ないと思われる",null,"テビケイ錠50ｍｇ"]
["テプレノンカプセル50ｍｇ「トーワ」","東和",null,"●","b",null,"b",{"$nulls":5},"テプレノンカプセル50ｍｇ「トーワ」"]
["テモカプリル塩酸塩錠２ｍｇ「タカタ」","高田",null,"●","b",null,"b",{"$nulls":5},"テモカプリル塩酸塩錠２ｍｇ「タカタ」"]
["テモダールカプセル１００ｍｇ","MSD",null,"×","b",null,"b",{"$nulls":3},"抗がん剤","調製者の暴露に注意","テモダールカプセル１００ｍｇ"]
["テモダールカプセル２０ｍｇ","MSD",null,"×","b",null,"b",{"$nulls":3},"抗がん剤","調製者の暴露に注意","テモダールカプセル２０ｍｇ"]
["ドグマチール錠５０ｍｇ",null,null,"●","b",null,"b",{"$nulls":5},"ドグマチール錠５０ｍｇ"]
["ドパストン散９８．５％",{"$nulls":3},"b",null,"b",{"$nulls":3},"ドパミン製剤のため酸化マグネシウムと同時懸濁しない","酸化マグネシウム（マグラックスなど）と同時懸濁しない","ドパストン散９８．５％"]
["トビエース錠4ｍｇ","ファイザー",null,"×","g",null,null,"g",null,null,"徐放",null,"トビエース錠4ｍｇ"]
["トピナ細粒１０％","協和発酵キリン",null,null,"b",null,null,"b",{"$nulls":4},"トピナ細粒１０％"]
["トピナ錠５０ｍｇ","協和発酵キリン",null,"▲","b",null,null,"b",{"$nulls":4},"トピナ錠５０ｍｇ"]
["ドプスOD錠２００ｍｇ","大日本住友",null,"●","e",null,null,"e",null,null,"ドパミン製剤のため酸化マグネシウムと同時懸濁しない","酸化マグネシウム（マグラックスなど）と同時懸濁しない","ドプスOD錠２００ｍｇ"]
["ドプス細粒　２０％","大日本住友",null,null,"g","g",{"$nulls":4},"OD錠に変更",null,"ドプス細粒　２０％"]
["トフラニール錠１０ｍｇ",null,null,"▲","g",null,"g",{"$nulls":5},"トフラニール錠１０ｍｇ"]
["ドミン錠",null,null,"▲","b",null,"b",{"$nulls":5},"ドミン錠"]
["トラクリア錠６２．５ｍｇ","アクテリオンファーマ",null,"▲","b",null,null,"b",{"$nulls":4},"トラクリア錠６２．５ｍｇ"]
["トラゼンタ錠5ｍｇ","ベーリンガー",null,"▲","b",{"$nulls":3},"b",{"$nulls":3},"トラゼンタ錠5ｍｇ"]
["トラベルミン配合錠",null,null,"●","c",null,"c",{"$nulls":5},"トラベルミン配合錠"]
["トラマールOD錠２５ｍｇ","ファイザー",null,"●","b",null,null,"b",{"$nulls":4},"トラマールOD錠２５ｍｇ"]
["トラムセット配合錠","持田製薬","ヤンセン","●","b",{"$nulls":3},"b",{"$nulls":3},"トラムセット配合錠"]
["ドラ－ル錠１５　１５ｍｇ",null,null,"▲","b",null,"b",{"$nulls":5},"ドラ－ル錠１５　１５ｍｇ"]
["トランサミンカプセル　２５０ｍｇ",null,null,"●","b",null,"b",{"$nulls":5},"トランサミンカプセル　２５０ｍｇ"]
["トリアゾラム錠０．１２５ｍｇ「テバ」","テバ",null,"●","b",null,"b",{"$nulls":5},"トリアゾラム錠０．１２５ｍｇ「テバ」"]
["トリプタノ－ル錠　１０ｍｇ",null,null,"●","b",null,"b",{"$nulls":5},"トリプタノ－ル錠　１０ｍｇ"]
["トレドミン錠２５　２５ｍｇ",null,null,"▲","b",null,"b",{"$nulls":5},"トレドミン錠２５　２５ｍｇ"]
["トロペロン錠1ｍｇ",null,null,"▲","b",null,"b",{"$nulls":5},"トロペロン錠1ｍｇ"]
["ドンペリドン錠１０ｍｇ　「ＥＭＥＣ」",null,null,"●","b",null,"b",{"$nulls":5},"ドンペリドン錠１０ｍｇ　「ＥＭＥＣ」"]
["ナイキサン錠　１００ｍｇ",null,null,"●","b",null,"b",{"$nulls":5},"ナイキサン錠　１００ｍｇ"]
["ニコチン酸アミド散ゾンネ　１０％",{"$nulls":3},"b",null,"b",{"$nulls":5},"ニコチン酸アミド散ゾンネ　１０％"]
["ニコランジル錠5mg「日医工」","日医工",null,"●","b",null,"b",{"$nulls":5},"ニコランジル錠5mg「日医工」"]
["ニッパスカルシウム顆粒１００％","田辺三菱",null,null,"g","g",{"$nulls":4},"必要時相談",null,"ニッパスカルシウム顆粒１００％"]
["ニトロール錠　５ｍｇ",null,null,"▲","b",null,"b",{"$nulls":5},"ニトロール錠　５ｍｇ"]
["ニトロペン舌下錠　０．３ｍｇ","日本化薬",null,"×","g","g",{"$nulls":4},"特殊",null,"ニトロペン舌下錠　０．３ｍｇ"]
["ニバジール錠２ｍｇ",null,null,"▲","b",null,"b",{"$nulls":5},"ニバジール錠２ｍｇ"]
["ニフェジピンCR錠２０ｍｇ「日医工」","日医工",null,"●","g","g",{"$nulls":4},"徐放",null,"ニフェジピンCR錠２０ｍｇ「日医工」"]
["ニポラジン錠　３ｍｇ　",null,null,"▲","b",null,"b",{"$nulls":5},"ニポラジン錠　３ｍｇ　"]
["ニュ－ロタン錠　５０ｍｇ",null,null,"●","c",null,"c",{"$nulls":5},"ニュ－ロタン錠　５０ｍｇ"]
["ネオマレルミンＴＲ錠6ｍｇ","テバ",null,"●","g",null,"g",{"$nulls":5},"ネオマレルミンＴＲ錠6ｍｇ"]
["ネオ－ラル２５ｍｇ",null,null,"×","b",null,"b",{"$nulls":3},"特殊",null,"ネオ－ラル２５ｍｇ"]
["ネキシウムカプセル２０ｍｇ",null,null,"●","b",null,"b",{"$nulls":5},"ネキシウムカプセル２０ｍｇ"]
["ネクサバール錠２００ｍｇ","バイエル",null,"×","g",null,"g",{"$nulls":3},"抗がん剤/懸濁はするがチューブ閉塞","調製者の暴露に注意","ネクサバール錠２００ｍｇ"]
["ネシーナ錠　１２．５ｍｇ","武田",null,"●","c",null,null,"c",{"$nulls":4},"ネシーナ錠　１２．５ｍｇ"]
["ノイエルカプセル　２００ｍｇ",null,null,"●","b",null,"b",{"$nulls":5},"ノイエルカプセル　２００ｍｇ"]
["ノイキノン錠１０ｍｇ　",null,null,"●","b",null,"b",{"$nulls":5},"ノイキノン錠１０ｍｇ　"]
["ノイロトロピン錠　４単位　",null,null,"▲","g",null,"g",{"$nulls":5},"ノイロトロピン錠　４単位　"]
["ノウリアスト錠20ｍｇ","協和発酵キリン",null,"▲","b",null,null,"b",null,null,"光に不安定",null,"ノウリアスト錠20ｍｇ"]
["ノバミン錠５ｍｇ",null,null,"●","b",null,"b",{"$nulls":5},"ノバミン錠５ｍｇ"]
["ノ－ビア錠１００ｍｇ","アッヴィ",null,"×","g",null,null,"g",null,null,"HIV　カレトラ粉砕によりリトナビルのAUCが39%低下したため不適",null,"ノ－ビア錠１００ｍｇ"]
["ノルバデックス錠２０ｍｇ",null,null,"×","b",null,"b",{"$nulls":3},"抗がん剤","調製者の暴露に注意","ノルバデックス錠２０ｍｇ"]
["パーロデル２．５ｍｇ",null,null,"▲","g",null,"g",{"$nulls":5},"パーロデル２．５ｍｇ"]
["バイアスピリン",null,null,"●","g",null,"g",{"$nulls":5},"バイアスピリン"]
["バイカロン錠　２５ｍｇ",null,null,"▲","b",null,"b",{"$nulls":5},"バイカロン錠　２５ｍｇ"]
["バイシリンＧ顆粒４０万単位",{"$nulls":3},"b",null,"b",{"$nulls":5},"バイシリンＧ顆粒４０万単位"]
["ハイドレアカプセル",null,null,"×","b",null,"b",{"$nulls":3},"抗がん剤","調製者の暴露に注意","ハイドレアカプセル"]
["ハイペン錠200ｍｇ　",null,null,"●","b",null,"b",{"$nulls":5},"ハイペン錠200ｍｇ　"]
["パキシルCR錠12.5ｍｇ","グラクソ",null,"▲","g",null,null,"g",{"$nulls":4},"パキシルCR錠12.5ｍｇ"]
["バクタ配合錠",null,null,"●","b",null,"b",{"$nulls":5},"バクタ配合錠"]
["バップフォ－錠10ｍｇ",null,null,"▲",{"$f":"IF(F387&G387&H387&H387&I387&J387=\"\",\"\",IF(F387&G387&H387&I387=\"\",J387,IF(F387&G387&H387=\"\",I387,(IF(F387&G387=\"\",H387,IF(F387=\"\",G387,F387))))))","v":"b"},null,"b",{"$nulls":5},"バップフォ－錠10ｍｇ"]
["パナルジン錠100ｍｇ",null,null,"▲","c",null,"c",{"$nulls":5},"パナルジン錠100ｍｇ"]
["バファリン配合錠Ａ330",null,null,"×","b",null,"b",{"$nulls":5},"バファリン配合錠Ａ330"]
["バラクルード錠０．５ｍｇ","ブリストルマイヤーズ",null,"×","b",null,null,"b",{"$nulls":4},"バラクルード錠０．５ｍｇ"]
["バルサルタン錠80ｍｇ「サンド」","サンド",null,"●","b",null,null,"b",{"$nulls":4},"バルサルタン錠80ｍｇ「サンド」"]
["バルトレックス錠500ｍｇ","グラクソ",null,"▲","c",null,"c",{"$nulls":5},"バルトレックス錠500ｍｇ"]
["バルトレックス顆粒５０％","グラクソ",null,null,"g",null,null,"g",{"$nulls":4},"バルトレックス顆粒５０％"]
["ハルナールＤ錠0.2ｍｇ",null,null,"●","b",null,"b",{"$nulls":5},"ハルナールＤ錠0.2ｍｇ"]
["バレイショデンプン","日本新薬","シオエ",null,"",{"$nulls":7},"バレイショデンプン"]
["パントシン錠100",null,null,"▲","g",null,"g",{"$nulls":5},"パントシン錠100"]
["ビ・シフロール錠0.125ｍｇ","ブリストルマイヤーズ",null,"▲","b",{"$nulls":3},"b",{"$nulls":3},"ビ・シフロール錠0.125ｍｇ"]
["ビ・シフロール錠0.5ｍｇ","ブリストルマイヤーズ",null,"▲","b",{"$nulls":3},"b",{"$nulls":3},"ビ・シフロール錠0.5ｍｇ"]
["ビソルボン細粒　２％",{"$nulls":3},"b",null,"b",{"$nulls":5},"ビソルボン細粒　２％"]
["ビソルボン錠　４ｍｇ",null,null,"●","b",null,"b",{"$nulls":5},"ビソルボン錠　４ｍｇ"]
["ビタメジン配合カプセルＢ２５",null,null,"●","b",null,"b",{"$nulls":5},"ビタメジン配合カプセルＢ２５"]
["ヒダントール錠２５ｍｇ",null,null,"▲","b",null,"b",{"$nulls":5},"ヒダントール錠２５ｍｇ"]
["ピドキサール錠　１０ｍｇ","中外",null,"●","g",null,"g",{"$nulls":5},"ピドキサール錠　１０ｍｇ"]
["ビビアント錠２０ｍｇ　","ファイザー",null,"▲","b",{"$nulls":3},"b",{"$nulls":3},"ビビアント錠２０ｍｇ　"]
["ビブラマイシン錠　１００ｍｇ",null,null,"▲","c",null,"c",{"$nulls":5},"ビブラマイシン錠　１００ｍｇ"]
["ピラマイド",{"$nulls":3},"b",null,"b",{"$nulls":5},"ピラマイド"]
["ビリアード錠３００ｍｇ","日本たばこ",null,"×","b",null,"b",{"$nulls":3},"HIV",null,"ビリアード錠３００ｍｇ"]
["ビルトリシド錠600ｍｇ","バイエル",null,"×","b",null,"b",{"$nulls":5},"ビルトリシド錠600ｍｇ"]
["ヒルナミン細粒１０％",{"$nulls":3},"b",null,"b",{"$nulls":4},"ゆっくり注入してください。","ヒルナミン細粒１０％"]
["ピレスパ錠２００ｍｇ","塩野義",null,"▲","b",null,"b",{"$nulls":5},"ピレスパ錠２００ｍｇ"]
["ファスティック錠９０ｍｇ",null,null,"×","b",null,"b",{"$nulls":5},"ファスティック錠９０ｍｇ"]
["ファモチジンＤ錠20ｍｇ「サワイ」",null,null,"●","b",null,"b",{"$nulls":5},"ファモチジンＤ錠20ｍｇ「サワイ」"]
["ファロム錠200ｍｇ",null,null,"▲","g",null,"g",{"$nulls":5},"ファロム錠200ｍｇ"]
["ブイフェンド錠５０ｍｇ","ファイザー",null,"×","b",null,"b",{"$nulls":5},"ブイフェンド錠５０ｍｇ"]
["フェアストン錠　４０ｍｇ",null,null,"×","b",null,"b",{"$nulls":3},"抗がん剤","調製者の暴露に注意","フェアストン錠　４０ｍｇ"]
["フェキソフェナジン塩酸塩錠６０ｍｇ「SANIK」","日医工サノフィー",null,"●","g",null,null,"g",{"$nulls":4},"フェキソフェナジン塩酸塩錠６０ｍｇ「SANIK」"]
["フェネルミン錠50mg",null,null,"●","b",null,"b",{"$nulls":5},"フェネルミン錠50mg"]
["フェノバール散　１０％","第一三共","藤永",null,"b",null,null,"b",{"$nulls":4},"フェノバール散　１０％"]
["フェノバール錠３０ｍｇ","藤永",null,"▲","b",null,"b",{"$nulls":5},"フェノバール錠３０ｍｇ"]
["フェブリク錠２０ｍｇ","帝人ファーマ",null,"●","b",null,"b",{"$nulls":5},"フェブリク錠２０ｍｇ"]
["フェマーラ錠　２．５ｍｇ","ノバルティス",null,"×","b",null,"b",{"$nulls":3},"抗がん剤","調製者の暴露に注意","フェマーラ錠　２．５ｍｇ"]
["フェロ・グラデュメット錠１０５ｍｇ　",null,null,"●","g",null,"g",{"$nulls":5},"フェロ・グラデュメット錠１０５ｍｇ　"]
["フェロベリン錠","MSD",null,"▲","b",null,"b",{"$nulls":5},"フェロベリン錠"]
["フオイパン錠　１００ｍｇ",null,null,"●","b",null,"b",{"$nulls":5},"フオイパン錠　１００ｍｇ"]
["フォサマック錠３５ｍｇ","MSD",null,"×","b",null,null,"b",null,null,"特殊",null,"フォサマック錠３５ｍｇ"]
["フォスブロック錠２５０ｍｇ","協和発酵キリン",null,"●","g",null,null,"g",null,null,"吸湿性で膨脹",null,"フォスブロック錠２５０ｍｇ"]
["フォリアミン錠　５ｍｇ",null,null,"▲","b",null,"b",{"$nulls":5},"フォリアミン錠　５ｍｇ"]
["ブスコパン錠　１０ｍｇ",null,null,"▲","b",null,"b",{"$nulls":5},"ブスコパン錠　１０ｍｇ"]
["プラザキサカプセル　１１０ｍｇ","ベーリンガー",null,"×","g",null,null,"g",null,null,"脱カプセルでAUC上昇",null,"プラザキサカプセル　１１０ｍｇ"]
["プラザキサカプセル　７５ｍｇ","ベーリンガー",null,"×","g",null,null,"g",null,null,"脱カプセルでAUC上昇",null,"プラザキサカプセル　７５ｍｇ"]
["フラジール内服錠　２５０ｍｇ",null,null,"●","g",null,"g",{"$nulls":5},"フラジール内服錠　２５０ｍｇ"]
["ブラダロン錠２００ｍｇ",null,null,"▲","b",null,"b",{"$nulls":5},"ブラダロン錠２００ｍｇ"]
["プラノバール",null,null,"▲","b",null,"b",{"$nulls":5},"プラノバール"]
["プラビックス錠２５ｍｇ","サノフィ",null,"▲","c",null,"c",{"$nulls":5},"プラビックス錠２５ｍｇ"]
["プラビックス錠７５ｍｇ","サノフィ",null,"●","c",null,"c",{"$nulls":5},"プラビックス錠７５ｍｇ"]
["プランルカスト錠１１２．５ｍｇ　「ＥＫ」","小林化工",null,"●","b",null,null,"b",null,null,"多めの水でフラッシュ","多めの水でフラッシュ","プランルカスト錠１１２．５ｍｇ　「ＥＫ」"]
["プリジスタナイーブ錠800ｍｇ","ヤンセン",null,"×","b",{"$nulls":3},"b",null,"HIV",null,"プリジスタナイーブ錠800ｍｇ"]
["フリバスＯＤ錠２５ｍｇ　",null,null,"●","b",null,"b",{"$nulls":5},"フリバスＯＤ錠２５ｍｇ　"]
["プリモボラン錠５ｍｇ",null,null,"▲","b",null,"b",{"$nulls":5},"プリモボラン錠５ｍｇ"]
["プリンペラン錠　５ｍｇ",null,null,"●","b",null,"b",{"$nulls":5},"プリンペラン錠　５ｍｇ"]
["フルイトラン錠２ｍｇ",null,null,"●","b",null,"b",{"$nulls":5},"フルイトラン錠２ｍｇ"]
["フルコナゾールカプセル１００ｍｇ「サワイ」","沢井",null,"●","b",null,"b",{"$nulls":5},"フルコナゾールカプセル１００ｍｇ「サワイ」"]
["フルダラ錠１０ｍｇ","サノフィ",null,"×","b",null,"b",{"$nulls":3},"抗がん剤（フルダラ静注あり）","調製者の暴露に注意","フルダラ錠１０ｍｇ"]
["フルバスタチン錠30mg「サワイ」","沢井",null,"●","b",null,"b",{"$nulls":5},"フルバスタチン錠30mg「サワイ」"]
["プレタールＯＤ錠　１００ｍｇ","大塚",null,"●","b",null,"b",{"$nulls":5},"プレタールＯＤ錠　１００ｍｇ"]
["ブレディニン錠　５０ｍｇ",null,null,"●","b",null,"b",{"$nulls":3},"残渣あるがフラッシュで通過",null,"ブレディニン錠　５０ｍｇ"]
["プレドニゾロン散「タケダ」　１％",{"$nulls":3},"b",null,"b",{"$nulls":5},"プレドニゾロン散「タケダ」　１％"]
["プレドニゾロン錠１ｍｇ（旭化成）",null,null,"●","b",null,"b",{"$nulls":5},"プレドニゾロン錠１ｍｇ（旭化成）"]
["プレドニン錠５ｍｇ",null,null,"●","b",null,"b",{"$nulls":5},"プレドニン錠５ｍｇ"]
["プレマリン錠０．６２５ｍｇ",null,null,"▲","g",null,"g",{"$nulls":5},"プレマリン錠０．６２５ｍｇ"]
["プレミネント配合錠ＬＤ","MSD",null,"●",{"$f":"IF(F451&G451&H451&H451&I451&J451=\"\",\"\",IF(F451&G451&H451&I451=\"\",J451,IF(F451&G451&H451=\"\",I451,(IF(F451&G451=\"\",H451,IF(F451=\"\",G451,F451))))))","v":"c"},{"$nulls":3},"c",{"$nulls":3},"プレミネント配合錠ＬＤ"]
["プログラフカプセル０．５ｍｇ","アステラス",null,"▲","b",{"$nulls":3},"b",{"$nulls":3},"プログラフカプセル０．５ｍｇ"]
["プログラフカプセル１ｍｇ",null,null,"▲","b",null,"b",{"$nulls":5},"プログラフカプセル１ｍｇ"]
["プロサイリン錠２０",null,null,"●","b",null,"b",{"$nulls":5},"プロサイリン錠２０"]
["プロスタ－ル錠２５　２５ｍｇ",null,null,"▲","b",null,"b",{"$nulls":5},"プロスタ－ル錠２５　２５ｍｇ"]
["プロセキソール錠　０．５ｍｇ","あすか",null,"×","g",null,null,"g",null,null,"抗がん剤/10分経過後も変化なし","調製者の暴露に注意","プロセキソール錠　０．５ｍｇ"]
["プロパジール錠　５０ｍｇ","中外",null,"▲","g",null,null,"g",null,null,"55℃20mL20分放置で懸濁可","多めの水でフラッシュ","プロパジール錠　５０ｍｇ"]
["ブロバリン","日本新薬",null,null,"g",{"$nulls":3},"g",null,"シリンジ内に残る","多めの水でフラッシュ","ブロバリン"]
["フロベン錠　４０ｍｇ",null,null,"▲","b",null,"b",{"$nulls":5},"フロベン錠　４０ｍｇ"]
["プロマックＤ錠７５",null,null,"×","b",null,"b",{"$nulls":5},"プロマックＤ錠７５"]
["フロモックス小児用細粒１００ｍｇ",{"$nulls":3},"b",null,"b",{"$nulls":5},"フロモックス小児用細粒１００ｍｇ"]
["フロリネフ錠　０．１ｍｇ",null,null,"●","b",null,"b",{"$nulls":5},"フロリネフ錠　０．１ｍｇ"]
["ベイスンＯＤ錠０．３",null,null,"●","b",null,"b",{"$nulls":5},"ベイスンＯＤ錠０．３"]
["ベゲタミンーＡ配合錠",null,null,"▲","g",null,"g",{"$nulls":5},"ベゲタミンーＡ配合錠"]
["ベゲタミンーＢ配合錠",null,null,"▲","g",null,"g",{"$nulls":5},"ベゲタミンーＢ配合錠"]
["ベサコリン散　５％",{"$nulls":3},"b",null,"b",{"$nulls":3},"水で溶解（温湯は不可）",null,"ベサコリン散　５％"]
["ベザトールＳＲ錠２００ｍｇ",null,null,"●","g",null,"g",{"$nulls":5},"ベザトールＳＲ錠２００ｍｇ"]
["ベサノイドカプセル　１０ｍｇ",null,null,"×","b",null,"b",{"$nulls":3},"抗がん剤","調製者の暴露に注意","ベサノイドカプセル　１０ｍｇ"]
["ベシケアＯＤ錠２．５ｍｇ","アステラス",null,"▲","g",null,null,"g",null,null,"有効成分をコーティングしてるものが沈殿しシリンジ内に残留粒子あり",null,"ベシケアＯＤ錠２．５ｍｇ"]
["ベシケアＯＤ錠５ｍｇ","アステラス",null,"●","g",null,null,"g",null,null,"有効成分をコーティングしてるものが沈殿しシリンジ内に残留粒子あり",null,"ベシケアＯＤ錠５ｍｇ"]
["ベタナミン錠１０ｍｇ","三和化学",null,"▲","b",null,null,"b",{"$nulls":4},"ベタナミン錠１０ｍｇ"]
["ベタニス錠５０ｍｇ","アステラス",null,"▲","g",null,null,"g",null,null,"徐放剤",null,"ベタニス錠５０ｍｇ"]
["ベプシドＳ２５　２５ｍｇ","ブリストルマイヤーズ",null,"×","g",null,null,"g",null,null,"抗がん剤（カプセルがシリンジに付着）","調製者の暴露に注意","ベプシドＳ２５　２５ｍｇ"]
["ヘプセラ錠１０","グラクソ",null,"×","b",null,"b","b",{"$nulls":4},"ヘプセラ錠１０"]
["ベプリコ－ル錠５０ｍｇ",null,null,"▲","b",null,"b",{"$nulls":5},"ベプリコ－ル錠５０ｍｇ"]
["ベラサスＬＡ錠60μｇ","科研",null,"▲","g",null,null,"g",null,null,"薬剤全体が徐放",null,"ベラサスＬＡ錠60μｇ"]
["ペラゾリン細粒　４００ｍｇ　０．５ｇ",{"$nulls":3},"b",null,"b",{"$nulls":5},"ペラゾリン細粒　４００ｍｇ　０．５ｇ"]
["ベリチーム配合顆粒　１ｇ",{"$nulls":3},"g",null,"g",{"$nulls":5},"ベリチーム配合顆粒　１ｇ"]
["ペリンドプリル錠４ｍｇ「日医工」","日医工",null,"●","b",null,"b",{"$nulls":5},"ペリンドプリル錠４ｍｇ「日医工」"]
["ペルサンチンＬカプセル　１５０ｍｇ",null,null,"×","e",null,"e",{"$nulls":3},"吸湿性","多めの水で懸濁しゆっくり注入","ペルサンチンＬカプセル　１５０ｍｇ"]
["ペルサンチン錠２５ｍｇ　",null,null,"▲","b",null,"b",{"$nulls":5},"ペルサンチン錠２５ｍｇ　"]
["ベルソムラ錠15ｍｇ","MSD",null,"×","g",{"$nulls":3},"g",{"$nulls":3},"ベルソムラ錠15ｍｇ"]
["ベルソムラ錠20ｍｇ","MSD",null,"×","g",{"$nulls":3},"g",{"$nulls":3},"ベルソムラ錠20ｍｇ"]
["ヘルベッサ－Ｒカプセル１００ｍｇ　",null,null,"●","g",null,"g",{"$nulls":5},"ヘルベッサ－Ｒカプセル１００ｍｇ　"]
["ペルマックス錠２５０μｇ",null,null,"×","b",null,"b",{"$nulls":5},"ペルマックス錠２５０μｇ"]
["ベンザリン錠　５ｍｇ",null,null,"●","b",null,"b",{"$nulls":5},"ベンザリン錠　５ｍｇ"]
["ペンタサ錠　５００ｍｇ",null,null,"▲","g",null,"g",{"$nulls":5},"ペンタサ錠　５００ｍｇ"]
["ホーネル錠　０．３μｇ",null,null,"▲","b",null,"b",{"$nulls":5},"ホーネル錠　０．３μｇ"]
["ホスミシン錠５００ｍｇ",null,null,"▲","b",null,"b",{"$nulls":5},"ホスミシン錠５００ｍｇ"]
["ボルタレンＳＲカプセル　３７．５ｍｇ",null,null,"●","e",null,"e",{"$nulls":4},"ゆっくり注入","ボルタレンＳＲカプセル　３７．５ｍｇ"]
["ボルタレン錠　２５ｍｇ",null,null,"●","c",null,"c",{"$nulls":5},"ボルタレン錠　２５ｍｇ"]
["ポルトラック原末　６ｇ",{"$nulls":3},"b",null,"b",{"$nulls":5},"ポルトラック原末　６ｇ"]
["ボンゾ－ル錠　２００ｍｇ",null,null,"▲","b",null,"b",{"$nulls":5},"ボンゾ－ル錠　２００ｍｇ"]
["マイスタン錠５ｍｇ",null,null,"▲","b",null,"b",{"$nulls":5},"マイスタン錠５ｍｇ"]
["マイテラ－ゼ　１０ｍｇ",null,null,"▲","b",null,"b",{"$nulls":3},"Tab少し残るがフラッシュで可",null,"マイテラ－ゼ　１０ｍｇ"]
["マグラックス錠２５０ｍｇ　",null,null,"×","b",null,"b",{"$nulls":5},"マグラックス錠２５０ｍｇ　"]
["マグラックス錠３３０ｍｇ　",null,null,"×","b",null,"b",{"$nulls":5},"マグラックス錠３３０ｍｇ　"]
["マドパー配合錠",null,null,"●","e",null,"e",{"$nulls":3},"ドパミン製剤のため酸化マグネシウムと同時懸濁しない","酸化マグネシウム（マグラックスなど）と同時懸濁しない","マドパー配合錠"]
["マブリン散　１％",{"$nulls":3},"b",null,"b",{"$nulls":5},"マブリン散　１％"]
["ミオナール錠５０ｍｇ　",null,null,"●","c",null,"c",{"$nulls":5},"ミオナール錠５０ｍｇ　"]
["ミカルディス錠４０ｍｇ","ベーリンガー",null,"●","c",null,null,"c",{"$nulls":4},"ミカルディス錠４０ｍｇ"]
["ミコブティンカプセル１５０ｍｇ","ファイザー",null,"▲","b",{"$nulls":3},"b",null,"カプセルの溶け残りがあれば取り除く",null,"ミコブティンカプセル１５０ｍｇ"]
["ミコンビ配合錠ＡＰ","ベーリンガー",null,"▲","g",{"$nulls":3},"g",{"$nulls":3},"ミコンビ配合錠ＡＰ"]
["ミニリンメルトＯＤ錠120μｇ","フェリングファーマ",null,"×","g","g",{"$nulls":6},"ミニリンメルトＯＤ錠120μｇ"]
["ミニリンメルトＯＤ錠60μｇ","フェリングファーマ",null,"×","g","g",{"$nulls":6},"ミニリンメルトＯＤ錠60μｇ"]
["ミノマイシン顆粒　２０ｍｇ",{"$nulls":3},"b",null,"b",{"$nulls":5},"ミノマイシン顆粒　２０ｍｇ"]
["ミヤＢＭ細粒　５００ｇ","ミヤリサン",null,null,"b",null,null,"b",null,null,"賦形剤の沈降炭酸カルシウムが溶け残る可能性あり→上清だけ注入を","溶け残りがある場合は上澄みのみ注入","ミヤＢＭ細粒　５００ｇ"]
["ミヤＢＭ錠","ミヤリサン",null,"●","b",null,null,"b",null,null,"細粒のデータなし/賦形剤の沈降炭酸カルシウムが溶け残る可能性あり→上清だけ注入を","溶け残りがある場合は上澄みのみ注入","ミヤＢＭ錠"]
["ミラペックスＬＡ錠０．３７５ｍｇ","ベーリンガー",null,"×","g",null,null,"g",null,"徐放",null,null,"ミラペックスＬＡ錠０．３７５ｍｇ"]
["ミラペックスＬＡ錠１．５ｍｇ","ベーリンガー",null,"×","g",null,null,"g",null,"徐放",null,null,"ミラペックスＬＡ錠１．５ｍｇ"]
["ムコスタ顆粒２０％　０．５ｇ",{"$nulls":3},"b",null,"b",{"$nulls":5},"ムコスタ顆粒２０％　０．５ｇ"]
["ムコダインＤＳ　５０％　１００Ｇ","杏林",null,null,"b",null,null,"b",{"$nulls":4},"ムコダインＤＳ　５０％　１００Ｇ"]
["メイアクトＭＳ小児用細粒　１００ｍｇ",{"$nulls":3},"b",null,"b",{"$nulls":5},"メイアクトＭＳ小児用細粒　１００ｍｇ"]
["メイラックス錠１ｍｇ",null,null,"●","b",null,"b",{"$nulls":5},"メイラックス錠１ｍｇ"]
["メインテート錠０．６２５ｍｇ","田辺三菱",null,"●",{"$f":"IF(F515&G515&H515&H515&I515&J515=\"\",\"\",IF(F515&G515&H515&I515=\"\",J515,IF(F515&G515&H515=\"\",I515,(IF(F515&G515=\"\",H515,IF(F515=\"\",G515,F515))))))","v":"c"},null,null,"c",{"$nulls":4},"メインテート錠０．６２５ｍｇ"]
["メインテート錠２．５ｍｇ　",null,null,"●","c",null,"c",{"$nulls":5},"メインテート錠２．５ｍｇ　"]
["メキシチールカプセル５０ｍｇ　",null,null,"●","b",null,"b",{"$nulls":5},"メキシチールカプセル５０ｍｇ　"]
["メジコン散　１０％",{"$nulls":3},"b",null,"b",{"$nulls":5},"メジコン散　１０％"]
["メジコン錠　１５ｍｇ",null,null,"●","b",null,"b",{"$nulls":5},"メジコン錠　１５ｍｇ"]
["メスチノン錠　６０ｍｇ",null,null,"▲","b",null,"b",{"$nulls":5},"メスチノン錠　６０ｍｇ"]
["メソトレキセート錠２．５ｍｇ",null,null,"×","g",null,"g",{"$nulls":3},"抗がん剤","調製者の暴露に注意","メソトレキセート錠２．５ｍｇ"]
["メタルカプタ－ゼカプセル２００ｍｇ",null,null,"▲","b",null,"b",{"$nulls":5},"メタルカプタ－ゼカプセル２００ｍｇ"]
["メチコバール錠５００μｇ　",null,null,"●","b",null,"b",{"$nulls":5},"メチコバール錠５００μｇ　"]
["メチルエルゴメトリン錠　０．１２５ｍｇ「あすか」　","あすか",null,"▲","b",null,"b",{"$nulls":5},"メチルエルゴメトリン錠　０．１２５ｍｇ「あすか」　"]
["メトグルコ錠　２５０ｍｇ","大日本住友",null,"●","b",{"$nulls":3},"b",{"$nulls":3},"メトグルコ錠　２５０ｍｇ"]
["メトリジン錠２ｍｇ",null,null,"●","b",null,"b",{"$nulls":5},"メトリジン錠２ｍｇ"]
["メトレート錠２ｍｇ","参天",null,"×","b",null,"b",{"$nulls":3},"抗がん剤","調製者の暴露に注意","メトレート錠２ｍｇ"]
["メドロール錠　４ｍｇ",null,null,"▲","b",null,"b",{"$nulls":5},"メドロール錠　４ｍｇ"]
["メネシット配合錠１００",null,null,"●","e",null,"e",{"$nulls":3},"ドパミン製剤のため酸化マグネシウムと同時懸濁しない","酸化マグネシウム（マグラックスなど）と同時懸濁しない","メネシット配合錠１００"]
["メプチン錠５０μｇ",null,null,"▲","b",null,"b",{"$nulls":5},"メプチン錠５０μｇ"]
["メマリーＯＤ錠20ｍｇ","第一三共",null,"▲","b",null,null,"b",null,null,"55℃以上は凝集物質が生成","55℃以下で懸濁","メマリーＯＤ錠20ｍｇ"]
["メリスロン錠　６ｍｇ",null,null,"●","b",null,"b",{"$nulls":5},"メリスロン錠　６ｍｇ"]
["メルカゾール錠　５ｍｇ",null,null,"●","g",null,"g",{"$nulls":5},"メルカゾール錠　５ｍｇ"]
["メンドン７．５ｍｇ",null,null,"▲","b",null,"b",{"$nulls":5},"メンドン７．５ｍｇ"]
["モサプリドクエン酸塩錠5mg「日医工」",null,null,"●","b",null,"b",{"$nulls":5},"モサプリドクエン酸塩錠5mg「日医工」"]
["モ－ビック錠１０ｍｇ","ベーリンガー",null,"▲","b",{"$nulls":3},"b",{"$nulls":3},"モ－ビック錠１０ｍｇ"]
["薬用炭",{"$nulls":3},"g","g",{"$nulls":6},"薬用炭"]
["ユーゼル錠２５ｍｇ","大鵬",null,"▲","b",null,"b",{"$nulls":5},"ユーゼル錠２５ｍｇ"]
["ユーロジン１ｍｇ錠",null,null,"●","b",null,"b",{"$nulls":5},"ユーロジン１ｍｇ錠"]
["ユ－エフティカプセル１００ｍｇ",null,null,"×","b",null,"b",{"$nulls":3},"抗がん剤","調製者の暴露に注意","ユ－エフティカプセル１００ｍｇ"]
["ユナシン細粒小児用　１００ｍｇ",{"$nulls":3},"g",null,"g",{"$nulls":5},"ユナシン細粒小児用　１００ｍｇ"]
["ユナシン錠　３７５ｍｇ",null,null,"▲","b",null,"b",{"$nulls":5},"ユナシン錠　３７５ｍｇ"]
["ユニフィルＬＡ錠２００ｍｇ",null,null,"▲","g",null,"g",{"$nulls":5},"ユニフィルＬＡ錠２００ｍｇ"]
["ユベラＮカプセル　１００ｍｇ",null,null,"●","b",null,"b",{"$nulls":5},"ユベラＮカプセル　１００ｍｇ"]
["ユリーフ錠４ｍｇ",null,null,"●","b",null,"b",{"$nulls":5},"ユリーフ錠４ｍｇ"]
["ユリノーム錠５０ｍｇ　",null,null,"●","b",null,"b",{"$nulls":5},"ユリノーム錠５０ｍｇ　"]
["ヨウ化カリウム「日医工」",{"$nulls":3},"b",null,"b",{"$nulls":5},"ヨウ化カリウム「日医工」"]
["ラシックス２０ｍｇ錠",null,null,"●","b",null,"b",{"$nulls":5},"ラシックス２０ｍｇ錠"]
["ラジレス錠１５０ｍｇ","ノバルティス",null,"×","g",{"$nulls":3},"g",{"$nulls":3},"ラジレス錠１５０ｍｇ"]
["ラックビ－Ｒ（シール）１ｇ",{"$nulls":3},"b",null,"b",{"$nulls":3},"温湯による生菌数低下の可能性あり",null,"ラックビ－Ｒ（シール）１ｇ"]
["ラックビー微粒Ｎ　１％　1GX1008包","興和創薬",null,null,"g",null,null,"g",{"$nulls":4},"ラックビー微粒Ｎ　１％　1GX1008包"]
["ラニラピッド錠　０．１ｍｇ",null,null,"●","b",null,"b",{"$nulls":5},"ラニラピッド錠　０．１ｍｇ"]
["ラフチジン錠10mg「日医工」","日医工",null,"●","b",null,"b",{"$nulls":5},"ラフチジン錠10mg「日医工」"]
["ラベキュアパック４００","エーザイ",null,"×","g","g",{"$nulls":4},"特殊",null,"ラベキュアパック４００"]
["ラベプラゾールNa塩錠10mg「明治」","Ｍｅｉｊｉ",null,"●","g",null,"g",{"$nulls":3},"腸瘻なら可",null,"ラベプラゾールNa塩錠10mg「明治」"]
["ラミクタール錠１００ｍｇ　","グラクソ",null,"▲","b",null,"b","b",{"$nulls":4},"ラミクタール錠１００ｍｇ　"]
["ラミクタール錠２５ｍｇ　","グラクソ",null,"▲","b",null,"b","b",{"$nulls":4},"ラミクタール錠２５ｍｇ　"]
["ラミクタール錠小児用２ｍｇ　","グラクソ",null,"▲","b",null,"b","b",{"$nulls":4},"ラミクタール錠小児用２ｍｇ　"]
["ラミクタール錠小児用５ｍｇ　","グラクソ",null,"▲","b",null,"b","b",{"$nulls":4},"ラミクタール錠小児用５ｍｇ　"]
["ランソプラゾールOD錠15mg「トーワ」",null,null,"●","e",null,"e",{"$nulls":4},"常温の水で懸濁","ランソプラゾールOD錠15mg「トーワ」"]
["リーゼ錠５ｍｇ",null,null,"●","b",null,"b",{"$nulls":5},"リーゼ錠５ｍｇ"]
["リーマス錠２００ｍｇ",null,null,"▲","c",null,"c",{"$nulls":5},"リーマス錠２００ｍｇ"]
["リオレサール錠５ｍｇ",null,null,"●","b",null,"b",{"$nulls":5},"リオレサール錠５ｍｇ"]
["リクシアナ錠60ｍｇ","第一三共",null,"●","b",null,null,"b",{"$nulls":4},"リクシアナ錠60ｍｇ"]
["リザベンカプセル１００ｍｇ",null,null,"▲","b",null,"b",{"$nulls":5},"リザベンカプセル１００ｍｇ"]
["リスパダ－ル錠１ｍｇ",null,null,"●","b",null,"b",{"$nulls":5},"リスパダ－ル錠１ｍｇ"]
["リスミー錠１ｍｇ",null,null,"●","b",null,"b",{"$nulls":5},"リスミー錠１ｍｇ"]
["リズミック錠１０ｍｇ",null,null,"●","b",null,"b",{"$nulls":5},"リズミック錠１０ｍｇ"]
["リ－バクト配合顆粒　４．１５ｇ",{"$nulls":3},"g",null,"g",{"$nulls":5},"リ－バクト配合顆粒　４．１５ｇ"]
["リパクレオンカプセル１５０ｍｇ","アボット",null,"●","g",null,null,"g",null,null,"胃内で失活",null,"リパクレオンカプセル１５０ｍｇ"]
["リバロ錠２ｍｇ","興和",null,"●","b",null,null,"b",null,null,"光に不安定なので懸濁後30分以内に注入","光に不安定なので懸濁後30分以内に注入","リバロ錠２ｍｇ"]
["リファジンカプセル　１５０ｍｇ","第一三共",null,"●","b",null,null,"b",null,null,"カプセルの一部がシリンジ付着するが通過には問題なし",null,"リファジンカプセル　１５０ｍｇ"]
["リフレックス錠１５ｍｇ","Ｍｅｉｊｉ",null,"▲","b",null,null,"b",{"$nulls":4},"リフレックス錠１５ｍｇ"]
["リボトリール細粒　０．１％",{"$nulls":3},"b",null,"b",{"$nulls":4},"多めの水でフラッシュ","リボトリール細粒　０．１％"]
["リボトリール錠０．５ｍｇ",null,null,"●","b",null,"b",{"$nulls":5},"リボトリール錠０．５ｍｇ"]
["リマチル　１００ｍｇ",null,null,"▲","g",null,"g",{"$nulls":5},"リマチル　１００ｍｇ"]
["リマプロストアルファデクス錠５μｇ「F」","富士製薬",null,"×","b",null,"b",{"$nulls":5},"リマプロストアルファデクス錠５μｇ「F」"]
["リリカカプセル２５ｍｇ　","ファイザー",null,"●","b",null,null,"b",null,null,"150mgのデータ参照",null,"リリカカプセル２５ｍｇ　"]
["リリカカプセル７５ｍｇ","ファイザー",null,"●",{"$f":"IF(F579&G579&H579&H579&I579&J579=\"\",\"\",IF(F579&G579&H579&I579=\"\",J579,IF(F579&G579&H579=\"\",I579,(IF(F579&G579=\"\",H579,IF(F579=\"\",G579,F579))))))","v":"b"},null,null,"b",null,null,"150mgのデータ参照",null,"リリカカプセル７５ｍｇ"]
["リルテック錠　５０ｍｇ",null,null,"▲","c",null,"c",{"$nulls":5},"リルテック錠　５０ｍｇ"]
["リンデロン散　０．１％",{"$nulls":3},"b",null,"b",{"$nulls":5},"リンデロン散　０．１％"]
["リンデロン錠　０．５ｍｇ",null,null,"●","b",null,"b",{"$nulls":5},"リンデロン錠　０．５ｍｇ"]
["ルーラン錠４ｍｇ",null,null,"▲","b",null,"b",{"$nulls":5},"ルーラン錠４ｍｇ"]
["ルジオミール錠１０ｍｇ",null,null,"▲","b",null,"b",{"$nulls":5},"ルジオミール錠１０ｍｇ"]
["ルセフィ錠2.5ｍｇ","大正富山",null,"▲","b",null,null,"b",{"$nulls":4},"ルセフィ錠2.5ｍｇ"]
["ルネスタ錠1ｍｇ","エーザイ",null,"●","g",null,"g",{"$nulls":3},"類縁物質増加",null,"ルネスタ錠1ｍｇ"]
["ルプラック錠４ｍｇ",null,null,"●","b",null,"b",{"$nulls":5},"ルプラック錠４ｍｇ"]
["ルボックス錠　２５ｍｇ",null,null,"●","c",null,"c",{"$nulls":5},"ルボックス錠　２５ｍｇ"]
["ルリッド錠１５０",null,null,"▲","b",null,"b",{"$nulls":5},"ルリッド錠１５０"]
["レイアタッツカプセル１５０ｍｇ","ブリストルマイヤーズ",null,"×","b",null,"b",{"$nulls":3},"HIV",null,"レイアタッツカプセル１５０ｍｇ"]
["レキップＣＲ錠２ｍｇ","グラクソ",null,"▲","b",null,null,"b",{"$nulls":4},"レキップＣＲ錠２ｍｇ"]
["レキップ錠０．２５ｍｇ","グラクソ",null,"▲","b",null,"b","b",{"$nulls":4},"レキップ錠０．２５ｍｇ"]
["レキップ錠１ｍｇ","グラクソ",null,"▲","b",null,"b","b",{"$nulls":4},"レキップ錠１ｍｇ"]
["レキップ錠ＣＲ8ｍｇ","グラクソ",null,"▲","b",null,null,"b",{"$nulls":4},"レキップ錠ＣＲ8ｍｇ"]
["レクサプロ錠１０ｍｇ","田辺三菱","持田製薬","▲","b",null,null,"b",{"$nulls":4},"レクサプロ錠１０ｍｇ"]
["レクシヴァ錠７００","ヴィーブ",null,"×","c",null,"c",{"$nulls":3},"HIV",null,"レクシヴァ錠７００"]
["レクチゾール錠２５ｍｇ",null,null,"▲","b",null,"b",{"$nulls":5},"レクチゾール錠２５ｍｇ"]
["レグパラ錠25ｍｇ","協和発酵キリン",null,"●","b",null,null,"b",{"$nulls":4},"レグパラ錠25ｍｇ"]
["レスタミンコーワ錠　１０ｍｇ",null,null,"▲","c",null,"c",{"$nulls":5},"レスタミンコーワ錠　１０ｍｇ"]
["レダマイシンカプセル　１５０ｍｇ",null,null,"▲","b",null,"b",{"$nulls":5},"レダマイシンカプセル　１５０ｍｇ"]
["レトロビルカプセル　１００ｍｇ",null,null,"×","b",null,"b",{"$nulls":3},"HIV",null,"レトロビルカプセル　１００ｍｇ"]
["レナデックス錠　４ｍｇ","セルジーン",null,"▲","b",{"$nulls":3},"b",{"$nulls":3},"レナデックス錠　４ｍｇ"]
["レバチオ錠２０ｍｇ","ファイザー",null,"▲","b",null,null,"b",null,null,"120mlのフラッシュ必要","多めの水でフラッシュ","レバチオ錠２０ｍｇ"]
["レバミピド錠100mg「EMEC」","ＥＭＥＣ","大原","●","b",null,"b","b",{"$nulls":4},"レバミピド錠100mg「EMEC」"]
["レフト－ゼ錠（５０ｍｇ）",null,null,"▲","c",null,"c",{"$nulls":5},"レフト－ゼ錠（５０ｍｇ）"]
["レブラミドカプセル　５ｍｇ","セルジーン",null,"×","b",null,null,"b",null,null,"抗がん剤","調製者の暴露に注意","レブラミドカプセル　５ｍｇ"]
["レベトールカプセル２００ｍｇ","MSD",null,"▲","b",{"$nulls":3},"b",null,"カプセルがゼラチンのため溶解は可だが催奇形性・原薬の刺激性あり","調製者の暴露に注意","レベトールカプセル２００ｍｇ"]
["レボフロキサシン錠２５０ｍｇ「DSEP]","第一三共エスファ",null,"▲","c",null,null,"c",{"$nulls":4},"レボフロキサシン錠２５０ｍｇ「DSEP]"]
["レボフロキサシン錠５００ｍｇ「DSEP]","第一三共エスファ",null,"●","c",null,null,"c",{"$nulls":4},"レボフロキサシン錠５００ｍｇ「DSEP]"]
["レボレード錠　１２．５ｍｇ","グラクソ",null,"×","g",null,null,"g",null,null,"懸濁するとAUC22％上昇",null,"レボレード錠　１２．５ｍｇ"]
["レミニールＯＤ錠　４ｍｇ","武田","ヤンセン","▲","b",{"$nulls":3},"b",{"$nulls":3},"レミニールＯＤ錠　４ｍｇ"]
["ロイケリン散　１０％",{"$nulls":3},"b",null,"b",{"$nulls":5},"ロイケリン散　１０％"]
["ロイコボリン錠５ｍｇ","ファイザー",null,"▲","b",null,"b",{"$nulls":5},"ロイコボリン錠５ｍｇ"]
["ロイコン錠１０ｍｇ",null,null,"▲","b",null,"b",{"$nulls":5},"ロイコン錠１０ｍｇ"]
["ロカルトロ－ルカプセル０．５μｇ",null,null,"▲","b",null,"b",{"$nulls":5},"ロカルトロ－ルカプセル０．５μｇ"]
["ロキソプロフェン錠６０ｍｇ　「ＥＭＥＣ」",null,null,"●","c",null,"c",{"$nulls":5},"ロキソプロフェン錠６０ｍｇ　「ＥＭＥＣ」"]
["ロゼレム錠８ｍｇ","武田",null,"●","c",null,null,"c",{"$nulls":4},"ロゼレム錠８ｍｇ"]
["ロペミンカプセル　１ｍｇ　","ヤンセン",null,"●","b",null,"b",{"$nulls":5},"ロペミンカプセル　１ｍｇ　"]
["ロルカム錠４ｍｇ",null,null,"▲","b",null,"b",{"$nulls":5},"ロルカム錠４ｍｇ"]
["ワーファリン錠１ｍｇ",null,null,"●","b",null,"b",{"$nulls":5},"ワーファリン錠１ｍｇ"]
["ワイパックス錠　０．５ｍｇ",null,null,"●","b",null,"b",{"$nulls":5},"ワイパックス錠　０．５ｍｇ"]
["ワカデニン腸溶錠10ｍｇ","わかもと",null,"▲","g","g",{"$nulls":4},"胃酸に弱い",null,"ワカデニン腸溶錠10ｍｇ"]
["ワソラン錠４０ｍｇ",null,null,"●","c",null,"c",{"$nulls":5},"ワソラン錠４０ｍｇ"]
["ワンアルファ錠　０．２５μｇ　",null,null,"●","b",null,"b",{"$nulls":5},"ワンアルファ錠　０．２５μｇ　"]
["ワンアルファ錠　１μｇ　",null,null,"●","b",null,"b",{"$nulls":5},"ワンアルファ錠　１μｇ　"]
["塩酸プロカルバジンカプセル　５０ｍｇ","中外",null,"×","b",null,"b",{"$nulls":3},"抗がん剤","調製者の暴露に注意","塩酸プロカルバジンカプセル　５０ｍｇ"]
["塩酸ミノサイクリンカプセル１００「日医工」","日医工",null,"●","b",null,"b",{"$nulls":3},"色が濃いのでフラッシュ必要","多めの水でフラッシュ","塩酸ミノサイクリンカプセル１００「日医工」"]
["臭化カリウム　１００ｇ","山善",null,null,"b",null,null,"b",{"$nulls":4},"臭化カリウム　１００ｇ"]
["炭酸水素ナトリウム　５００ｇ「シオエ」","日本新薬","シオエ",null,"b",{"$nulls":3},"b",null,"アルカリ性になる　「シオエ」のデータはないが可と考える",null,"炭酸水素ナトリウム　５００ｇ「シオエ」"]
["調剤用パンビタン末","武田",null,null,"b",{"$nulls":3},"b",{"$nulls":3},"調剤用パンビタン末"]
["乳酸カルシウム「ヨシダ」　",{"$nulls":3},"b",null,"b",{"$nulls":5},"乳酸カルシウム「ヨシダ」　"]
["乳糖　（粒状）　５００ｇ","健栄",null,null,"b",null,null,"b",{"$nulls":4},"乳糖　（粒状）　５００ｇ"]
["硫酸ポリミキシンＢ錠100万単位","ファイザ-",null,"▲","g",null,"g",{"$nulls":5},"硫酸ポリミキシンＢ錠100万単位"]